Raspbian Package Auto-Building

Build log for gfccore (2.3.1-7.1) on armhf

gfccore2.3.1-7.1armhf → 2017-06-18 16:18:44

sbuild (Debian sbuild) 0.72.0 (25 Oct 2016) on mb-lxc-01

+==============================================================================+
| gfccore 2.3.1-7.1 (armhf)                    Sun, 18 Jun 2017 08:07:48 +0000 |
+==============================================================================+

Package: gfccore
Version: 2.3.1-7.1
Source Version: 2.3.1-7.1
Distribution: jessie-staging
Machine Architecture: armhf
Host Architecture: armhf
Build Architecture: armhf

I: NOTICE: Log filtering will replace 'var/lib/schroot/mount/jessie-staging-armhf-sbuild-3688617e-cb00-435d-a0cf-19b7fb082f04' with '<<CHROOT>>'

+------------------------------------------------------------------------------+
| Update chroot                                                                |
+------------------------------------------------------------------------------+

Get:1 http://172.17.0.1 jessie-staging InRelease [11.3 kB]
Get:2 http://172.17.0.1 jessie-staging/main Sources [7754 kB]
Get:3 http://172.17.0.1 jessie-staging/main armhf Packages [9533 kB]
Fetched 17.3 MB in 12s (1395 kB/s)
Reading package lists...

+------------------------------------------------------------------------------+
| Fetch source files                                                           |
+------------------------------------------------------------------------------+


Check APT
---------

Checking available source versions...

Download source files with APT
------------------------------

Reading package lists...
Building dependency tree...
Need to get 888 kB of source archives.
Get:1 http://172.17.0.1/private/ jessie-staging/main gfccore 2.3.1-7.1 (dsc) [1934 B]
Get:2 http://172.17.0.1/private/ jessie-staging/main gfccore 2.3.1-7.1 (tar) [882 kB]
Get:3 http://172.17.0.1/private/ jessie-staging/main gfccore 2.3.1-7.1 (diff) [4418 B]
Fetched 888 kB in 0s (2225 kB/s)
Download complete and in download only mode
I: NOTICE: Log filtering will replace 'build/gfccore-n13lHW/gfccore-2.3.1' with '<<PKGBUILDDIR>>'
I: NOTICE: Log filtering will replace 'build/gfccore-n13lHW' with '<<BUILDDIR>>'

+------------------------------------------------------------------------------+
| Install build-essential                                                      |
+------------------------------------------------------------------------------+


Setup apt archive
-----------------

Merged Build-Depends: build-essential, fakeroot
Filtered Build-Depends: build-essential, fakeroot
dpkg-deb: building package `sbuild-build-depends-core-dummy' in `/<<BUILDDIR>>/resolver-BPHEt4/apt_archive/sbuild-build-depends-core-dummy.deb'.
dpkg-scanpackages: warning: Packages in archive but missing from override file:
dpkg-scanpackages: warning:   sbuild-build-depends-core-dummy
dpkg-scanpackages: info: Wrote 1 entries to output Packages file.
gpg: keyring `/<<BUILDDIR>>/resolver-BPHEt4/gpg/secring.gpg' created
gpg: keyring `/<<BUILDDIR>>/resolver-BPHEt4/gpg/pubring.gpg' created
gpg: /<<BUILDDIR>>/resolver-BPHEt4/gpg/trustdb.gpg: trustdb created
gpg: key F90AF620: public key "Sbuild Signer (Sbuild Build Dependency Archive Key) <buildd-tools-devel@lists.alioth.debian.org>" imported
gpg: Total number processed: 1
gpg:               imported: 1  (RSA: 1)
gpg: key F90AF620: secret key imported
gpg: key F90AF620: "Sbuild Signer (Sbuild Build Dependency Archive Key) <buildd-tools-devel@lists.alioth.debian.org>" not changed
gpg: Total number processed: 1
gpg:              unchanged: 1
gpg:       secret keys read: 1
gpg:   secret keys imported: 1
Ign copy: ./ InRelease
Get:1 copy: ./ Release.gpg [299 B]
Get:2 copy: ./ Release [957 B]
Get:3 copy: ./ Sources [349 B]
Get:4 copy: ./ Packages [433 B]
Fetched 2038 B in 0s (52.4 kB/s)
Reading package lists...
Reading package lists...

Install core build dependencies (apt-based resolver)
----------------------------------------------------

Installing build dependencies
Reading package lists...
Building dependency tree...
The following NEW packages will be installed:
  sbuild-build-depends-core-dummy
0 upgraded, 1 newly installed, 0 to remove and 0 not upgraded.
Need to get 816 B of archives.
After this operation, 0 B of additional disk space will be used.
Get:1 copy:/<<BUILDDIR>>/resolver-BPHEt4/apt_archive/ ./ sbuild-build-depends-core-dummy 0.invalid.0 [816 B]
debconf: delaying package configuration, since apt-utils is not installed
Fetched 816 B in 0s (0 B/s)
Selecting previously unselected package sbuild-build-depends-core-dummy.
(Reading database ... 12035 files and directories currently installed.)
Preparing to unpack .../sbuild-build-depends-core-dummy_0.invalid.0_armhf.deb ...
Unpacking sbuild-build-depends-core-dummy (0.invalid.0) ...
Setting up sbuild-build-depends-core-dummy (0.invalid.0) ...

+------------------------------------------------------------------------------+
| Check architectures                                                          |
+------------------------------------------------------------------------------+

Arch check ok (armhf included in any)

+------------------------------------------------------------------------------+
| Install package build dependencies                                           |
+------------------------------------------------------------------------------+


Setup apt archive
-----------------

Merged Build-Depends: cdbs, debhelper (>= 4.1.46), dpatch, binutils (>= 2.14.90.0.7), libsigc++-2.0-dev (>= 2.0.16-2), libglib2.0-dev
Filtered Build-Depends: cdbs, debhelper (>= 4.1.46), dpatch, binutils (>= 2.14.90.0.7), libsigc++-2.0-dev (>= 2.0.16-2), libglib2.0-dev
dpkg-deb: building package `sbuild-build-depends-gfccore-dummy' in `/<<BUILDDIR>>/resolver-BPHEt4/apt_archive/sbuild-build-depends-gfccore-dummy.deb'.
dpkg-scanpackages: warning: Packages in archive but missing from override file:
dpkg-scanpackages: warning:   sbuild-build-depends-core-dummy sbuild-build-depends-gfccore-dummy
dpkg-scanpackages: info: Wrote 2 entries to output Packages file.
Ign copy: ./ InRelease
Get:1 copy: ./ Release.gpg [299 B]
Get:2 copy: ./ Release [963 B]
Get:3 copy: ./ Sources [537 B]
Get:4 copy: ./ Packages [620 B]
Fetched 2419 B in 0s (61.8 kB/s)
Reading package lists...
Reading package lists...

Install gfccore build dependencies (apt-based resolver)
-------------------------------------------------------

Installing build dependencies
Reading package lists...
Building dependency tree...
Reading state information...
The following extra packages will be installed:
  bsdmainutils cdbs debhelper dpatch file gettext gettext-base groff-base
  intltool-debian libasprintf0c2 libcroco3 libelfg0 libexpat1 libffi6
  libglib2.0-0 libglib2.0-bin libglib2.0-data libglib2.0-dev libmagic1
  libpcre3-dev libpcrecpp0 libpipeline1 libpython-stdlib libpython2.7-minimal
  libpython2.7-stdlib libsigc++-2.0-0c2a libsigc++-2.0-dev libsqlite3-0
  libssl1.0.0 libunistring0 libxml2 man-db mime-support pkg-config po-debconf
  python python-minimal python2.7 python2.7-minimal zlib1g-dev
Suggested packages:
  wamerican wordlist whois vacation devscripts dh-make curl gettext-doc groff
  libglib2.0-doc libsigc++-2.0-doc less www-browser libmail-box-perl
  python-doc python-tk python2.7-doc binfmt-support
Recommended packages:
  autotools-dev patchutils autopoint libasprintf-dev libgettextpo-dev
  shared-mime-info xdg-user-dirs xml-core libmail-sendmail-perl
The following NEW packages will be installed:
  bsdmainutils cdbs debhelper dpatch file gettext gettext-base groff-base
  intltool-debian libasprintf0c2 libcroco3 libelfg0 libexpat1 libffi6
  libglib2.0-0 libglib2.0-bin libglib2.0-data libglib2.0-dev libmagic1
  libpcre3-dev libpcrecpp0 libpipeline1 libpython-stdlib libpython2.7-minimal
  libpython2.7-stdlib libsigc++-2.0-0c2a libsigc++-2.0-dev libsqlite3-0
  libssl1.0.0 libunistring0 libxml2 man-db mime-support pkg-config po-debconf
  python python-minimal python2.7 python2.7-minimal
  sbuild-build-depends-gfccore-dummy zlib1g-dev
0 upgraded, 41 newly installed, 0 to remove and 0 not upgraded.
Need to get 20.5 MB of archives.
After this operation, 64.4 MB of additional disk space will be used.
Get:1 copy:/<<BUILDDIR>>/resolver-BPHEt4/apt_archive/ ./ sbuild-build-depends-gfccore-dummy 0.invalid.0 [868 B]
Get:2 http://172.17.0.1/private/ jessie-staging/main libpipeline1 armhf 1.4.0-1 [24.0 kB]
Get:3 http://172.17.0.1/private/ jessie-staging/main libssl1.0.0 armhf 1.0.1t-1+deb8u6 [853 kB]
Get:4 http://172.17.0.1/private/ jessie-staging/main groff-base armhf 1.22.2-8 [1045 kB]
Get:5 http://172.17.0.1/private/ jessie-staging/main bsdmainutils armhf 9.0.6 [177 kB]
Get:6 http://172.17.0.1/private/ jessie-staging/main man-db armhf 2.7.0.2-5 [972 kB]
Get:7 http://172.17.0.1/private/ jessie-staging/main libasprintf0c2 armhf 0.19.3-2 [31.1 kB]
Get:8 http://172.17.0.1/private/ jessie-staging/main libmagic1 armhf 1:5.22+15-2+deb8u3 [244 kB]
Get:9 http://172.17.0.1/private/ jessie-staging/main libsqlite3-0 armhf 3.8.7.1-1+deb8u2 [377 kB]
Get:10 http://172.17.0.1/private/ jessie-staging/main libxml2 armhf 2.9.1+dfsg1-5+deb8u4 [705 kB]
Get:11 http://172.17.0.1/private/ jessie-staging/main libpython2.7-minimal armhf 2.7.9-2+deb8u1 [376 kB]
Get:12 http://172.17.0.1/private/ jessie-staging/main python2.7-minimal armhf 2.7.9-2+deb8u1 [1150 kB]
Get:13 http://172.17.0.1/private/ jessie-staging/main python-minimal armhf 2.7.9-1 [40.1 kB]
Get:14 http://172.17.0.1/private/ jessie-staging/main mime-support all 3.58 [36.0 kB]
Get:15 http://172.17.0.1/private/ jessie-staging/main libexpat1 armhf 2.1.0-6+deb8u3 [60.5 kB]
Get:16 http://172.17.0.1/private/ jessie-staging/main libffi6 armhf 3.1-2 [18.1 kB]
Get:17 http://172.17.0.1/private/ jessie-staging/main libpython2.7-stdlib armhf 2.7.9-2+deb8u1 [1812 kB]
Get:18 http://172.17.0.1/private/ jessie-staging/main python2.7 armhf 2.7.9-2+deb8u1 [252 kB]
Get:19 http://172.17.0.1/private/ jessie-staging/main libpython-stdlib armhf 2.7.9-1 [19.6 kB]
Get:20 http://172.17.0.1/private/ jessie-staging/main python armhf 2.7.9-1 [151 kB]
Get:21 http://172.17.0.1/private/ jessie-staging/main libglib2.0-0 armhf 2.42.1-1 [2250 kB]
Get:22 http://172.17.0.1/private/ jessie-staging/main libcroco3 armhf 0.6.8-3 [121 kB]
Get:23 http://172.17.0.1/private/ jessie-staging/main libelfg0 armhf 0.8.13-5 [55.7 kB]
Get:24 http://172.17.0.1/private/ jessie-staging/main libpcrecpp0 armhf 2:8.35-3.3+deb8u4 [140 kB]
Get:25 http://172.17.0.1/private/ jessie-staging/main libsigc++-2.0-0c2a armhf 2.4.0-1 [49.8 kB]
Get:26 http://172.17.0.1/private/ jessie-staging/main libunistring0 armhf 0.9.3-5.2 [253 kB]
Get:27 http://172.17.0.1/private/ jessie-staging/main file armhf 1:5.22+15-2+deb8u3 [60.1 kB]
Get:28 http://172.17.0.1/private/ jessie-staging/main gettext-base armhf 0.19.3-2 [116 kB]
Get:29 http://172.17.0.1/private/ jessie-staging/main cdbs all 0.4.130+deb8u1 [77.1 kB]
Get:30 http://172.17.0.1/private/ jessie-staging/main gettext armhf 0.19.3-2 [1167 kB]
Get:31 http://172.17.0.1/private/ jessie-staging/main intltool-debian all 0.35.0+20060710.1 [29.8 kB]
Get:32 http://172.17.0.1/private/ jessie-staging/main po-debconf all 1.0.16+nmu3 [220 kB]
Get:33 http://172.17.0.1/private/ jessie-staging/main debhelper all 9.20150101+deb8u2 [817 kB]
Get:34 http://172.17.0.1/private/ jessie-staging/main dpatch all 2.0.35 [95.2 kB]
Get:35 http://172.17.0.1/private/ jessie-staging/main libglib2.0-data all 2.42.1-1 [2173 kB]
Get:36 http://172.17.0.1/private/ jessie-staging/main libglib2.0-bin armhf 2.42.1-1 [1334 kB]
Get:37 http://172.17.0.1/private/ jessie-staging/main libpcre3-dev armhf 2:8.35-3.3+deb8u4 [413 kB]
Get:38 http://172.17.0.1/private/ jessie-staging/main pkg-config armhf 0.28-1 [55.1 kB]
Get:39 http://172.17.0.1/private/ jessie-staging/main zlib1g-dev armhf 1:1.2.8.dfsg-2 [199 kB]
Get:40 http://172.17.0.1/private/ jessie-staging/main libglib2.0-dev armhf 2.42.1-1 [2472 kB]
Get:41 http://172.17.0.1/private/ jessie-staging/main libsigc++-2.0-dev armhf 2.4.0-1 [109 kB]
debconf: delaying package configuration, since apt-utils is not installed
Fetched 20.5 MB in 5s (3747 kB/s)
Selecting previously unselected package libpipeline1:armhf.
(Reading database ... 12035 files and directories currently installed.)
Preparing to unpack .../libpipeline1_1.4.0-1_armhf.deb ...
Unpacking libpipeline1:armhf (1.4.0-1) ...
Selecting previously unselected package libssl1.0.0:armhf.
Preparing to unpack .../libssl1.0.0_1.0.1t-1+deb8u6_armhf.deb ...
Unpacking libssl1.0.0:armhf (1.0.1t-1+deb8u6) ...
Selecting previously unselected package groff-base.
Preparing to unpack .../groff-base_1.22.2-8_armhf.deb ...
Unpacking groff-base (1.22.2-8) ...
Selecting previously unselected package bsdmainutils.
Preparing to unpack .../bsdmainutils_9.0.6_armhf.deb ...
Unpacking bsdmainutils (9.0.6) ...
Selecting previously unselected package man-db.
Preparing to unpack .../man-db_2.7.0.2-5_armhf.deb ...
Unpacking man-db (2.7.0.2-5) ...
Selecting previously unselected package libasprintf0c2:armhf.
Preparing to unpack .../libasprintf0c2_0.19.3-2_armhf.deb ...
Unpacking libasprintf0c2:armhf (0.19.3-2) ...
Selecting previously unselected package libmagic1:armhf.
Preparing to unpack .../libmagic1_1%3a5.22+15-2+deb8u3_armhf.deb ...
Unpacking libmagic1:armhf (1:5.22+15-2+deb8u3) ...
Selecting previously unselected package libsqlite3-0:armhf.
Preparing to unpack .../libsqlite3-0_3.8.7.1-1+deb8u2_armhf.deb ...
Unpacking libsqlite3-0:armhf (3.8.7.1-1+deb8u2) ...
Selecting previously unselected package libxml2:armhf.
Preparing to unpack .../libxml2_2.9.1+dfsg1-5+deb8u4_armhf.deb ...
Unpacking libxml2:armhf (2.9.1+dfsg1-5+deb8u4) ...
Selecting previously unselected package libpython2.7-minimal:armhf.
Preparing to unpack .../libpython2.7-minimal_2.7.9-2+deb8u1_armhf.deb ...
Unpacking libpython2.7-minimal:armhf (2.7.9-2+deb8u1) ...
Selecting previously unselected package python2.7-minimal.
Preparing to unpack .../python2.7-minimal_2.7.9-2+deb8u1_armhf.deb ...
Unpacking python2.7-minimal (2.7.9-2+deb8u1) ...
Selecting previously unselected package python-minimal.
Preparing to unpack .../python-minimal_2.7.9-1_armhf.deb ...
Unpacking python-minimal (2.7.9-1) ...
Selecting previously unselected package mime-support.
Preparing to unpack .../mime-support_3.58_all.deb ...
Unpacking mime-support (3.58) ...
Selecting previously unselected package libexpat1:armhf.
Preparing to unpack .../libexpat1_2.1.0-6+deb8u3_armhf.deb ...
Unpacking libexpat1:armhf (2.1.0-6+deb8u3) ...
Selecting previously unselected package libffi6:armhf.
Preparing to unpack .../libffi6_3.1-2_armhf.deb ...
Unpacking libffi6:armhf (3.1-2) ...
Selecting previously unselected package libpython2.7-stdlib:armhf.
Preparing to unpack .../libpython2.7-stdlib_2.7.9-2+deb8u1_armhf.deb ...
Unpacking libpython2.7-stdlib:armhf (2.7.9-2+deb8u1) ...
Selecting previously unselected package python2.7.
Preparing to unpack .../python2.7_2.7.9-2+deb8u1_armhf.deb ...
Unpacking python2.7 (2.7.9-2+deb8u1) ...
Selecting previously unselected package libpython-stdlib:armhf.
Preparing to unpack .../libpython-stdlib_2.7.9-1_armhf.deb ...
Unpacking libpython-stdlib:armhf (2.7.9-1) ...
Setting up libpython2.7-minimal:armhf (2.7.9-2+deb8u1) ...
Setting up python2.7-minimal (2.7.9-2+deb8u1) ...
Setting up python-minimal (2.7.9-1) ...
Selecting previously unselected package python.
(Reading database ... 13432 files and directories currently installed.)
Preparing to unpack .../python_2.7.9-1_armhf.deb ...
Unpacking python (2.7.9-1) ...
Selecting previously unselected package libglib2.0-0:armhf.
Preparing to unpack .../libglib2.0-0_2.42.1-1_armhf.deb ...
Unpacking libglib2.0-0:armhf (2.42.1-1) ...
Selecting previously unselected package libcroco3:armhf.
Preparing to unpack .../libcroco3_0.6.8-3_armhf.deb ...
Unpacking libcroco3:armhf (0.6.8-3) ...
Selecting previously unselected package libelfg0:armhf.
Preparing to unpack .../libelfg0_0.8.13-5_armhf.deb ...
Unpacking libelfg0:armhf (0.8.13-5) ...
Selecting previously unselected package libpcrecpp0:armhf.
Preparing to unpack .../libpcrecpp0_2%3a8.35-3.3+deb8u4_armhf.deb ...
Unpacking libpcrecpp0:armhf (2:8.35-3.3+deb8u4) ...
Selecting previously unselected package libsigc++-2.0-0c2a:armhf.
Preparing to unpack .../libsigc++-2.0-0c2a_2.4.0-1_armhf.deb ...
Unpacking libsigc++-2.0-0c2a:armhf (2.4.0-1) ...
Selecting previously unselected package libunistring0:armhf.
Preparing to unpack .../libunistring0_0.9.3-5.2_armhf.deb ...
Unpacking libunistring0:armhf (0.9.3-5.2) ...
Selecting previously unselected package file.
Preparing to unpack .../file_1%3a5.22+15-2+deb8u3_armhf.deb ...
Unpacking file (1:5.22+15-2+deb8u3) ...
Selecting previously unselected package gettext-base.
Preparing to unpack .../gettext-base_0.19.3-2_armhf.deb ...
Unpacking gettext-base (0.19.3-2) ...
Selecting previously unselected package cdbs.
Preparing to unpack .../cdbs_0.4.130+deb8u1_all.deb ...
Unpacking cdbs (0.4.130+deb8u1) ...
Selecting previously unselected package gettext.
Preparing to unpack .../gettext_0.19.3-2_armhf.deb ...
Unpacking gettext (0.19.3-2) ...
Selecting previously unselected package intltool-debian.
Preparing to unpack .../intltool-debian_0.35.0+20060710.1_all.deb ...
Unpacking intltool-debian (0.35.0+20060710.1) ...
Selecting previously unselected package po-debconf.
Preparing to unpack .../po-debconf_1.0.16+nmu3_all.deb ...
Unpacking po-debconf (1.0.16+nmu3) ...
Selecting previously unselected package debhelper.
Preparing to unpack .../debhelper_9.20150101+deb8u2_all.deb ...
Unpacking debhelper (9.20150101+deb8u2) ...
Selecting previously unselected package dpatch.
Preparing to unpack .../archives/dpatch_2.0.35_all.deb ...
Unpacking dpatch (2.0.35) ...
Selecting previously unselected package libglib2.0-data.
Preparing to unpack .../libglib2.0-data_2.42.1-1_all.deb ...
Unpacking libglib2.0-data (2.42.1-1) ...
Selecting previously unselected package libglib2.0-bin.
Preparing to unpack .../libglib2.0-bin_2.42.1-1_armhf.deb ...
Unpacking libglib2.0-bin (2.42.1-1) ...
Selecting previously unselected package libpcre3-dev:armhf.
Preparing to unpack .../libpcre3-dev_2%3a8.35-3.3+deb8u4_armhf.deb ...
Unpacking libpcre3-dev:armhf (2:8.35-3.3+deb8u4) ...
Selecting previously unselected package pkg-config.
Preparing to unpack .../pkg-config_0.28-1_armhf.deb ...
Unpacking pkg-config (0.28-1) ...
Selecting previously unselected package zlib1g-dev:armhf.
Preparing to unpack .../zlib1g-dev_1%3a1.2.8.dfsg-2_armhf.deb ...
Unpacking zlib1g-dev:armhf (1:1.2.8.dfsg-2) ...
Selecting previously unselected package libglib2.0-dev.
Preparing to unpack .../libglib2.0-dev_2.42.1-1_armhf.deb ...
Unpacking libglib2.0-dev (2.42.1-1) ...
Selecting previously unselected package libsigc++-2.0-dev:armhf.
Preparing to unpack .../libsigc++-2.0-dev_2.4.0-1_armhf.deb ...
Unpacking libsigc++-2.0-dev:armhf (2.4.0-1) ...
Selecting previously unselected package sbuild-build-depends-gfccore-dummy.
Preparing to unpack .../sbuild-build-depends-gfccore-dummy_0.invalid.0_armhf.deb ...
Unpacking sbuild-build-depends-gfccore-dummy (0.invalid.0) ...
Setting up libpipeline1:armhf (1.4.0-1) ...
Setting up libssl1.0.0:armhf (1.0.1t-1+deb8u6) ...
Setting up groff-base (1.22.2-8) ...
Setting up bsdmainutils (9.0.6) ...
update-alternatives: using /usr/bin/bsd-write to provide /usr/bin/write (write) in auto mode
update-alternatives: using /usr/bin/bsd-from to provide /usr/bin/from (from) in auto mode
Setting up man-db (2.7.0.2-5) ...
Not building database; man-db/auto-update is not 'true'.
Setting up libasprintf0c2:armhf (0.19.3-2) ...
Setting up libmagic1:armhf (1:5.22+15-2+deb8u3) ...
Setting up libsqlite3-0:armhf (3.8.7.1-1+deb8u2) ...
Setting up libxml2:armhf (2.9.1+dfsg1-5+deb8u4) ...
Setting up mime-support (3.58) ...
Setting up libexpat1:armhf (2.1.0-6+deb8u3) ...
Setting up libffi6:armhf (3.1-2) ...
Setting up libpython2.7-stdlib:armhf (2.7.9-2+deb8u1) ...
Setting up python2.7 (2.7.9-2+deb8u1) ...
Setting up libpython-stdlib:armhf (2.7.9-1) ...
Setting up python (2.7.9-1) ...
Setting up libglib2.0-0:armhf (2.42.1-1) ...
No schema files found: doing nothing.
Setting up libcroco3:armhf (0.6.8-3) ...
Setting up libelfg0:armhf (0.8.13-5) ...
Setting up libpcrecpp0:armhf (2:8.35-3.3+deb8u4) ...
Setting up libsigc++-2.0-0c2a:armhf (2.4.0-1) ...
Setting up libunistring0:armhf (0.9.3-5.2) ...
Setting up file (1:5.22+15-2+deb8u3) ...
Setting up gettext-base (0.19.3-2) ...
Setting up cdbs (0.4.130+deb8u1) ...
Setting up gettext (0.19.3-2) ...
Setting up intltool-debian (0.35.0+20060710.1) ...
Setting up po-debconf (1.0.16+nmu3) ...
Setting up debhelper (9.20150101+deb8u2) ...
Setting up dpatch (2.0.35) ...
Setting up libglib2.0-data (2.42.1-1) ...
Setting up libglib2.0-bin (2.42.1-1) ...
Setting up libpcre3-dev:armhf (2:8.35-3.3+deb8u4) ...
Setting up pkg-config (0.28-1) ...
Setting up zlib1g-dev:armhf (1:1.2.8.dfsg-2) ...
Setting up libglib2.0-dev (2.42.1-1) ...
Setting up libsigc++-2.0-dev:armhf (2.4.0-1) ...
Setting up sbuild-build-depends-gfccore-dummy (0.invalid.0) ...
Processing triggers for libc-bin (2.19-18+deb8u9) ...

+------------------------------------------------------------------------------+
| Build environment                                                            |
+------------------------------------------------------------------------------+

Kernel: Linux 4.4.0-79-generic armhf (armv8l)
Toolchain package versions: binutils_2.25-5+deb8u1 dpkg-dev_1.17.27 g++-4.9_4.9.2-10 gcc-4.9_4.9.2-10 libc6-dev_2.19-18+deb8u9 libstdc++-4.9-dev_4.9.2-10 libstdc++6_4.9.2-10 linux-libc-dev_3.16.7-ckt11-1+deb8u4+rpi1
Package versions: acl_2.2.52-2 adduser_3.113+nmu3 apt_1.0.9.8.4 base-files_8+rpi1 base-passwd_3.5.37 bash_4.3-11+deb8u1 binutils_2.25-5+deb8u1 bsdmainutils_9.0.6 bsdutils_1:2.25.2-6 build-essential_11.7 bzip2_1.0.6-7 cdbs_0.4.130+deb8u1 coreutils_8.23-4 cpio_2.11+dfsg-4.1+deb8u1 cpp_4:4.9.2-2 cpp-4.9_4.9.2-10 dash_0.5.7-4 debconf_1.5.56 debconf-i18n_1.5.56 debfoster_2.7-2 debhelper_9.20150101+deb8u2 debianutils_4.4 diffutils_1:3.3-1 dmsetup_2:1.02.90-2.2+deb8u1 dpatch_2.0.35 dpkg_1.17.27 dpkg-dev_1.17.27 e2fslibs_1.42.12-2 e2fsprogs_1.42.12-2 fakeroot_1.20.2-1 file_1:5.22+15-2+deb8u3 findutils_4.4.2-9 g++_4:4.9.2-2 g++-4.9_4.9.2-10 gcc_4:4.9.2-2 gcc-4.6-base_4.6.4-5+rpi1 gcc-4.7-base_4.7.3-11+rpi1 gcc-4.8-base_4.8.4-1 gcc-4.9_4.9.2-10 gcc-4.9-base_4.9.2-10 gettext_0.19.3-2 gettext-base_0.19.3-2 gnupg_1.4.18-7+deb8u3 gpgv_1.4.18-7+deb8u3 grep_2.20-4.1 groff-base_1.22.2-8 gzip_1.6-4 hostname_3.15 init_1.22 init-system-helpers_1.22 initramfs-tools_0.120+deb8u3 initscripts_2.88dsf-59 insserv_1.14.0-5 intltool-debian_0.35.0+20060710.1 klibc-utils_2.0.4-2+rpi1 kmod_18-3 libacl1_2.2.52-2 libapt-pkg4.12_1.0.9.8.4 libasan1_4.9.2-10 libasprintf0c2_0.19.3-2 libatomic1_4.9.2-10 libattr1_1:2.4.47-2 libaudit-common_1:2.4-1 libaudit1_1:2.4-1 libblkid1_2.25.2-6 libbz2-1.0_1.0.6-7 libc-bin_2.19-18+deb8u9 libc-dev-bin_2.19-18+deb8u9 libc6_2.19-18+deb8u9 libc6-dev_2.19-18+deb8u9 libcap2_1:2.24-8 libcap2-bin_1:2.24-8 libcloog-isl4_0.18.2-1 libcomerr2_1.42.12-2 libcroco3_0.6.8-3 libcryptsetup4_2:1.6.6-5 libdb5.3_5.3.28-9 libdbus-1-3_1.8.22-0+deb8u1 libdebconfclient0_0.192 libdevmapper1.02.1_2:1.02.90-2.2+deb8u1 libdpkg-perl_1.17.27 libdrm2_2.4.58-2 libelfg0_0.8.13-5 libexpat1_2.1.0-6+deb8u3 libfakeroot_1.20.2-1 libffi6_3.1-2 libgc1c2_1:7.2d-6.4 libgcc-4.9-dev_4.9.2-10 libgcc1_1:4.9.2-10 libgcrypt20_1.6.3-2+deb8u3 libgdbm3_1.8.3-13.1 libglib2.0-0_2.42.1-1 libglib2.0-bin_2.42.1-1 libglib2.0-data_2.42.1-1 libglib2.0-dev_2.42.1-1 libgmp10_2:6.0.0+dfsg-6+rpi1 libgomp1_4.9.2-10 libgpg-error0_1.17-3 libisl10_0.12.2-2 libklibc_2.0.4-2+rpi1 libkmod2_18-3 liblocale-gettext-perl_1.05-8+b1 liblzma5_5.1.1alpha+20120614-2 libmagic1_1:5.22+15-2+deb8u3 libmount1_2.25.2-6 libmpc3_1.0.2-1 libmpfr4_3.1.2-2 libncurses5_5.9+20140913-1 libncursesw5_5.9+20140913-1 libnih-dbus1_1.0.3-4.3 libnih1_1.0.3-4.3 libpam-modules_1.1.8-3.1+deb8u2 libpam-modules-bin_1.1.8-3.1+deb8u2 libpam-runtime_1.1.8-3.1+deb8u2 libpam0g_1.1.8-3.1+deb8u2 libpcre3_2:8.35-3.3+deb8u4 libpcre3-dev_2:8.35-3.3+deb8u4 libpcrecpp0_2:8.35-3.3+deb8u4 libpipeline1_1.4.0-1 libpng12-0_1.2.50-2+deb8u3 libprocps3_2:3.3.9-9 libpython-stdlib_2.7.9-1 libpython2.7-minimal_2.7.9-2+deb8u1 libpython2.7-stdlib_2.7.9-2+deb8u1 libreadline6_6.3-8 libselinux1_2.3-2 libsemanage-common_2.3-1 libsemanage1_2.3-1 libsepol1_2.3-2 libsigc++-2.0-0c2a_2.4.0-1 libsigc++-2.0-dev_2.4.0-1 libslang2_2.3.0-2 libsmartcols1_2.25.2-6 libsqlite3-0_3.8.7.1-1+deb8u2 libss2_1.42.12-2 libssl1.0.0_1.0.1t-1+deb8u6 libstdc++-4.9-dev_4.9.2-10 libstdc++6_4.9.2-10 libsystemd0_215-17+deb8u7 libtext-charwidth-perl_0.04-7+b4 libtext-iconv-perl_1.7-5+b5 libtext-wrapi18n-perl_0.06-7 libtimedate-perl_2.3000-2 libtinfo5_5.9+20140913-1 libubsan0_4.9.2-10 libudev1_215-17+deb8u7 libunistring0_0.9.3-5.2 libusb-0.1-4_2:0.1.12-25 libustr-1.0-1_1.0.4-3 libuuid1_2.25.2-6 libxml2_2.9.1+dfsg1-5+deb8u4 linux-libc-dev_3.16.7-ckt11-1+deb8u4+rpi1 login_1:4.2-3+deb8u4 lsb-base_4.1+Debian13+rpi1+nmu1 make_4.0-8.1 makedev_2.3.1-93 man-db_2.7.0.2-5 mawk_1.3.3-17 mime-support_3.58 mount_2.25.2-6 mountall_2.54 multiarch-support_2.19-18+deb8u9 ncurses-base_5.9+20140913-1 ncurses-bin_5.9+20140913-1 passwd_1:4.2-3+deb8u4 patch_2.7.5-1 perl_5.20.2-3+deb8u7 perl-base_5.20.2-3+deb8u7 perl-modules_5.20.2-3+deb8u7 pkg-config_0.28-1 plymouth_0.9.0-9 po-debconf_1.0.16+nmu3 procps_2:3.3.9-9 python_2.7.9-1 python-minimal_2.7.9-1 python2.7_2.7.9-2+deb8u1 python2.7-minimal_2.7.9-2+deb8u1 raspbian-archive-keyring_20120528.2 readline-common_6.3-8 sbuild-build-depends-core-dummy_0.invalid.0 sbuild-build-depends-gfccore-dummy_0.invalid.0 sed_4.2.2-4+deb8u1 sensible-utils_0.0.9 startpar_0.59-3 systemd_215-17+deb8u7 systemd-sysv_215-17+deb8u7 sysv-rc_2.88dsf-59 sysvinit-utils_2.88dsf-59 tar_1.27.1-2 tzdata_2017b-0+deb8u1 udev_215-17+deb8u7 util-linux_2.25.2-6 xz-utils_5.1.1alpha+20120614-2 zlib1g_1:1.2.8.dfsg-2 zlib1g-dev_1:1.2.8.dfsg-2

+------------------------------------------------------------------------------+
| Build                                                                        |
+------------------------------------------------------------------------------+


Unpack source
-------------

gpgv: keyblock resource `/sbuild-nonexistent/.gnupg/trustedkeys.gpg': file open error
gpgv: Signature made Sun Nov 20 14:58:27 2011 UTC using RSA key ID 8649AA06
gpgv: Can't check signature: public key not found
dpkg-source: warning: failed to verify signature on ./gfccore_2.3.1-7.1.dsc
dpkg-source: info: extracting gfccore in /<<PKGBUILDDIR>>
dpkg-source: info: unpacking gfccore_2.3.1.orig.tar.gz
dpkg-source: info: applying gfccore_2.3.1-7.1.diff.gz

Check disk space
----------------

df: Warning: cannot read table of mounted file systems: No such file or directory
Sufficient free space for build

User Environment
----------------

APT_CONFIG=/var/lib/sbuild/apt.conf
DEB_BUILD_OPTIONS=parallel=4
HOME=/sbuild-nonexistent
LC_ALL=POSIX
LOGNAME=buildd
PATH=/usr/local/sbin:/usr/local/bin:/usr/sbin:/usr/bin:/sbin:/bin:/usr/games
SCHROOT_ALIAS_NAME=jessie-staging-armhf-sbuild
SCHROOT_CHROOT_NAME=jessie-staging-armhf-sbuild
SCHROOT_COMMAND=env
SCHROOT_GID=112
SCHROOT_GROUP=buildd
SCHROOT_SESSION_ID=jessie-staging-armhf-sbuild-3688617e-cb00-435d-a0cf-19b7fb082f04
SCHROOT_UID=107
SCHROOT_USER=buildd
SHELL=/bin/sh
USER=buildd

dpkg-buildpackage
-----------------

dpkg-buildpackage: source package gfccore
dpkg-buildpackage: source version 2.3.1-7.1
dpkg-buildpackage: source distribution unstable
 dpkg-source --before-build gfccore-2.3.1
dpkg-buildpackage: host architecture armhf
 fakeroot debian/rules clean
/usr/share/cdbs/1/rules/simple-patchsys.mk:31: CDBS WARNING:    simple-patchsys.mk is deprecated since 0.4.85 - please use source format 3.0 (quilt) instead
test -x debian/rules
rm -f debian/stamp-makefile-build debian/stamp-makefile-install
/usr/bin/make  -C .  -k distclean
make[1]: Entering directory '/<<PKGBUILDDIR>>'
make[1]: *** No rule to make target 'distclean'.
make[1]: Leaving directory '/<<PKGBUILDDIR>>'
/usr/share/cdbs/1/class/makefile.mk:55: recipe for target 'makefile-clean' failed
make: [makefile-clean] Error 2 (ignored)
rm -f debian/stamp-autotools
rmdir --ignore-fail-on-non-empty .
rmdir: failed to remove '.': Invalid argument
/usr/share/cdbs/1/class/autotools.mk:52: recipe for target 'makefile-clean' failed
make: [makefile-clean] Error 1 (ignored)
/usr/bin/make -f debian/rules reverse-config
make[1]: Entering directory '/<<PKGBUILDDIR>>'
/usr/share/cdbs/1/rules/simple-patchsys.mk:31: CDBS WARNING:    simple-patchsys.mk is deprecated since 0.4.85 - please use source format 3.0 (quilt) instead
for i in ./config.guess ./config.sub  ; do \
	if test -e $i.cdbs-orig ; then \
		mv $i.cdbs-orig $i ; \
	fi ; \
done
make[1]: Leaving directory '/<<PKGBUILDDIR>>'
if [ "reverse-patches" = "reverse-patches" ]; then rm -f debian/stamp-patched; fi
patches: 
if [ "reverse-patches" != "reverse-patches" ]; then touch debian/stamp-patched; fi
if [ "reverse-patches" != "reverse-patches" ] ; then \
	/usr/bin/make -f debian/rules update-config ; \
fi
for dir in debian/patches ; do \
    rm -f $dir/*.log ; \
done
for i in ./config.guess ./config.sub  ; do \
	if test -e $i.cdbs-orig ; then \
		mv $i.cdbs-orig $i ; \
	fi ; \
done
dh_clean 
dh_clean: Compatibility levels before 5 are deprecated (level 4 in use)
rm -f debian/stamp-autotools-files
dpatch  deapply-all  
04_fix-string-format-error not applied to ./ .
03_fix_g++_4.3_build not applied to ./ .
02_add_assignment_operator_to_properties not applied to ./ .
rm -rf patch-stamp patch-stampT debian/patched
 debian/rules build-arch
/usr/share/cdbs/1/rules/simple-patchsys.mk:31: CDBS WARNING:    simple-patchsys.mk is deprecated since 0.4.85 - please use source format 3.0 (quilt) instead
test -x debian/rules
mkdir -p "."
/usr/share/cdbs/1/rules/buildcore.mk:110: CDBS WARNING:    DEB_DH_STRIP_ARGS is deprecated since 0.4.85
/usr/bin/make -f debian/rules reverse-config
make[1]: Entering directory '/<<PKGBUILDDIR>>'
/usr/share/cdbs/1/rules/simple-patchsys.mk:31: CDBS WARNING:    simple-patchsys.mk is deprecated since 0.4.85 - please use source format 3.0 (quilt) instead
for i in ./config.guess ./config.sub  ; do \
	if test -e $i.cdbs-orig ; then \
		mv $i.cdbs-orig $i ; \
	fi ; \
done
make[1]: Leaving directory '/<<PKGBUILDDIR>>'
if [ "debian/stamp-patched" = "reverse-patches" ]; then rm -f debian/stamp-patched; fi
patches: 
if [ "debian/stamp-patched" != "reverse-patches" ]; then touch debian/stamp-patched; fi
if [ "debian/stamp-patched" != "reverse-patches" ] ; then \
	/usr/bin/make -f debian/rules update-config ; \
fi
make[1]: Entering directory '/<<PKGBUILDDIR>>'
/usr/share/cdbs/1/rules/simple-patchsys.mk:31: CDBS WARNING:    simple-patchsys.mk is deprecated since 0.4.85 - please use source format 3.0 (quilt) instead
if test -e /usr/share/misc/config.guess ; then \
	for i in ./config.guess ; do \
		if ! test -e $i.cdbs-orig ; then \
			mv $i $i.cdbs-orig ; \
			cp --remove-destination /usr/share/misc/config.guess $i ; \
		fi ; \
	done ; \
fi
if test -e /usr/share/misc/config.sub ; then \
	for i in ./config.sub ; do \
		if ! test -e $i.cdbs-orig ; then \
			mv $i $i.cdbs-orig ; \
			cp --remove-destination /usr/share/misc/config.sub $i ; \
		fi ; \
	done ; \
fi
make[1]: Leaving directory '/<<PKGBUILDDIR>>'
if test -e /usr/share/misc/config.guess ; then \
	for i in ./config.guess ; do \
		if ! test -e $i.cdbs-orig ; then \
			mv $i $i.cdbs-orig ; \
			cp --remove-destination /usr/share/misc/config.guess $i ; \
		fi ; \
	done ; \
fi
if test -e /usr/share/misc/config.sub ; then \
	for i in ./config.sub ; do \
		if ! test -e $i.cdbs-orig ; then \
			mv $i $i.cdbs-orig ; \
			cp --remove-destination /usr/share/misc/config.sub $i ; \
		fi ; \
	done ; \
fi
test -d debian/patched || install -d debian/patched
dpatch  apply-all  
applying patch 02_add_assignment_operator_to_properties to ./ ... ok.
applying patch 03_fix_g++_4.3_build to ./ ... ok.
applying patch 04_fix-string-format-error to ./ ... ok.
dpatch  cat-all  >>patch-stampT
mv -f patch-stampT patch-stamp
touch debian/stamp-autotools-files
chmod a+x /<<PKGBUILDDIR>>/./configure
mkdir -p .
cd . &&   CFLAGS="-g -O2 -fstack-protector-strong -Wformat -Werror=format-security -Wall" CXXFLAGS="-g -O2 -fstack-protector-strong -Wformat -Werror=format-security -Wall" CPPFLAGS="-D_FORTIFY_SOURCE=2" LDFLAGS="-Wl,-z,relro" /<<PKGBUILDDIR>>/./configure --build=arm-linux-gnueabihf  --prefix=/usr --includedir="\${prefix}/include" --mandir="\${prefix}/share/man" --infodir="\${prefix}/share/info" --sysconfdir=/etc --localstatedir=/var --libexecdir="\${prefix}/lib/gfccore" --srcdir=. --disable-maintainer-mode --disable-dependency-tracking --disable-silent-rules   --enable-static --enable-shared 
checking for a BSD-compatible install... /usr/bin/install -c
checking whether build environment is sane... yes
checking for gawk... no
checking for mawk... mawk
checking whether make sets $(MAKE)... yes
checking for pkg-config... /usr/bin/pkg-config
checking for sigc++-2.0 >= 2.0.0... yes
checking GFC_SIGC_CFLAGS... -I/usr/include/sigc++-2.0 -I/usr/lib/arm-linux-gnueabihf/sigc++-2.0/include 
checking GFC_SIGC_LIBS... -lsigc-2.0 
checking for glib-2.0 >= 2.4.0 gobject-2.0 >= 2.4.0 gmodule-2.0 >= 2.4.0 gthread-2.0 >= 2.4.0... yes
checking GFC_GLIB_CFLAGS... -pthread -I/usr/include/glib-2.0 -I/usr/lib/arm-linux-gnueabihf/glib-2.0/include 
checking GFC_GLIB_LIBS... -lgobject-2.0 -Wl,--export-dynamic -lgmodule-2.0 -pthread -lgthread-2.0 -pthread -lglib-2.0 
checking for gcc... gcc
checking for C compiler default output file name... a.out
checking whether the C compiler works... yes
checking whether we are cross compiling... no
checking for suffix of executables... 
checking for suffix of object files... o
checking whether we are using the GNU C compiler... yes
checking whether gcc accepts -g... yes
checking for gcc option to accept ANSI C... none needed
checking for style of include used by make... GNU
checking dependency style of gcc... none
checking how to run the C preprocessor... gcc -E
checking for g++... g++
checking whether we are using the GNU C++ compiler... yes
checking whether g++ accepts -g... yes
checking dependency style of g++... none
checking whether make sets $(MAKE)... (cached) yes
checking build system type... arm-unknown-linux-gnueabihf
checking host system type... arm-unknown-linux-gnueabihf
checking for a sed that does not truncate output... /bin/sed
checking for egrep... grep -E
checking for ld used by gcc... /usr/bin/ld
checking if the linker (/usr/bin/ld) is GNU ld... yes
checking for /usr/bin/ld option to reload object files... -r
checking for BSD-compatible nm... /usr/bin/nm -B
checking whether ln -s works... yes
checking how to recognise dependent libraries... pass_all
checking for ANSI C header files... yes
checking for sys/types.h... yes
checking for sys/stat.h... yes
checking for stdlib.h... yes
checking for string.h... yes
checking for memory.h... yes
checking for strings.h... yes
checking for inttypes.h... yes
checking for stdint.h... yes
checking for unistd.h... yes
checking dlfcn.h usability... yes
checking dlfcn.h presence... yes
checking for dlfcn.h... yes
checking how to run the C++ preprocessor... g++ -E
checking for g77... no
checking for f77... no
checking for xlf... no
checking for frt... no
checking for pgf77... no
checking for fort77... no
checking for fl32... no
checking for af77... no
checking for f90... no
checking for xlf90... no
checking for pgf90... no
checking for epcf90... no
checking for f95... no
checking for fort... no
checking for xlf95... no
checking for ifc... no
checking for efc... no
checking for pgf95... no
checking for lf95... no
checking for gfortran... no
checking whether we are using the GNU Fortran 77 compiler... no
checking whether  accepts -g... no
checking the maximum length of command line arguments... 32768
checking command to parse /usr/bin/nm -B output from gcc object... ok
checking for objdir... .libs
checking for ar... ar
checking for ranlib... ranlib
checking for strip... strip
checking if gcc static flag  works... yes
checking if gcc supports -fno-rtti -fno-exceptions... no
checking for gcc option to produce PIC... -fPIC
checking if gcc PIC flag -fPIC works... yes
checking if gcc supports -c -o file.o... yes
checking whether the gcc linker (/usr/bin/ld) supports shared libraries... yes
checking whether -lc should be explicitly linked in... no
checking dynamic linker characteristics... GNU/Linux ld.so
checking how to hardcode library paths into programs... immediate
checking whether stripping libraries is possible... yes
checking if libtool supports shared libraries... yes
checking whether to build shared libraries... yes
checking whether to build static libraries... yes
configure: creating libtool
appending configuration tag "CXX" to libtool
checking for ld used by g++... /usr/bin/ld
checking if the linker (/usr/bin/ld) is GNU ld... yes
checking whether the g++ linker (/usr/bin/ld) supports shared libraries... yes
checking for g++ option to produce PIC... -fPIC
checking if g++ PIC flag -fPIC works... yes
checking if g++ supports -c -o file.o... yes
checking whether the g++ linker (/usr/bin/ld) supports shared libraries... yes
checking dynamic linker characteristics... GNU/Linux ld.so
checking how to hardcode library paths into programs... immediate
checking whether stripping libraries is possible... yes
appending configuration tag "F77" to libtool
checking whether build environment is sane... yes
checking for ANSI C header files... (cached) yes
checking for an ANSI C-conforming const... yes
checking for size_t... yes
checking for mkstemp... yes
configure: creating ./config.status
config.status: creating Makefile
config.status: creating gfccore-2.0.pc
config.status: creating gfc/Makefile
config.status: creating gfc/gfccore.hh
config.status: creating gfc/glib/Makefile
config.status: creating gfc/glib/inline/Makefile
config.status: creating gfc/glib/private/Makefile
config.status: creating gfccore-config.h
config.status: executing depfiles commands
touch debian/stamp-autotools
/usr/bin/make  -C .  
make[1]: Entering directory '/<<PKGBUILDDIR>>'
cd . && /bin/bash /<<PKGBUILDDIR>>/missing --run autoheader
/<<PKGBUILDDIR>>/missing: line 52: autoheader: command not found
WARNING: `autoheader' is missing on your system.  You should only need it if
         you modified `acconfig.h' or `configure.ac'.  You might want
         to install the `Autoconf' and `GNU m4' packages.  Grab them
         from any GNU archive site.
rm -f stamp-h1
touch gfccore-config.h.in
cd . && /bin/bash ./config.status gfccore-config.h
config.status: creating gfccore-config.h
config.status: gfccore-config.h is unchanged
/usr/bin/make  all-recursive
make[2]: Entering directory '/<<PKGBUILDDIR>>'
Making all in gfc
make[3]: Entering directory '/<<PKGBUILDDIR>>/gfc'
Making all in glib
make[4]: Entering directory '/<<PKGBUILDDIR>>/gfc/glib'
Making all in inline
make[5]: Entering directory '/<<PKGBUILDDIR>>/gfc/glib/inline'
make[5]: Nothing to be done for 'all'.
make[5]: Leaving directory '/<<PKGBUILDDIR>>/gfc/glib/inline'
Making all in private
make[5]: Entering directory '/<<PKGBUILDDIR>>/gfc/glib/private'
make[5]: Nothing to be done for 'all'.
make[5]: Leaving directory '/<<PKGBUILDDIR>>/gfc/glib/private'
make[5]: Entering directory '/<<PKGBUILDDIR>>/gfc/glib'
/bin/bash ../../libtool --mode=compile g++ -DHAVE_CONFIG_H -I. -I. -I../..   -D_FORTIFY_SOURCE=2 -g -O2 -fstack-protector-strong -Wformat -Werror=format-security -Wall -pthread -I/usr/include/glib-2.0 -I/usr/lib/arm-linux-gnueabihf/glib-2.0/include  -I/usr/include/sigc++-2.0 -I/usr/lib/arm-linux-gnueabihf/sigc++-2.0/include  -g -O2 -fstack-protector-strong -Wformat -Werror=format-security -Wall -c -o asyncqueue.lo asyncqueue.cc
mkdir .libs
 g++ -DHAVE_CONFIG_H -I. -I. -I../.. -D_FORTIFY_SOURCE=2 -g -O2 -fstack-protector-strong -Wformat -Werror=format-security -Wall -pthread -I/usr/include/glib-2.0 -I/usr/lib/arm-linux-gnueabihf/glib-2.0/include -I/usr/include/sigc++-2.0 -I/usr/lib/arm-linux-gnueabihf/sigc++-2.0/include -g -O2 -fstack-protector-strong -Wformat -Werror=format-security -Wall -c asyncqueue.cc  -fPIC -DPIC -o .libs/asyncqueue.o
In file included from ../../gfc/glib/unicode.hh:30:0,
                 from ../../gfc/utfstring.hh:29,
                 from ../../gfc/trackable.hh:38,
                 from ../../gfc/object.hh:28,
                 from asyncqueue.hh:28,
                 from asyncqueue.cc:21:
/usr/include/glib-2.0/glib/gunicode.h:25:2: error: #error "Only <glib.h> can be included directly."
 #error "Only <glib.h> can be included directly."
  ^
In file included from /usr/include/glib-2.0/glib/gunicode.h:28:0,
                 from ../../gfc/glib/unicode.hh:30,
                 from ../../gfc/utfstring.hh:29,
                 from ../../gfc/trackable.hh:38,
                 from ../../gfc/object.hh:28,
                 from asyncqueue.hh:28,
                 from asyncqueue.cc:21:
/usr/include/glib-2.0/glib/gerror.h:24:2: error: #error "Only <glib.h> can be included directly."
 #error "Only <glib.h> can be included directly."
  ^
In file included from /usr/include/glib-2.0/glib/gerror.h:29:0,
                 from /usr/include/glib-2.0/glib/gunicode.h:28,
                 from ../../gfc/glib/unicode.hh:30,
                 from ../../gfc/utfstring.hh:29,
                 from ../../gfc/trackable.hh:38,
                 from ../../gfc/object.hh:28,
                 from asyncqueue.hh:28,
                 from asyncqueue.cc:21:
/usr/include/glib-2.0/glib/gquark.h:29:2: error: #error "Only <glib.h> can be included directly."
 #error "Only <glib.h> can be included directly."
  ^
In file included from /usr/include/glib-2.0/glib/gquark.h:32:0,
                 from /usr/include/glib-2.0/glib/gerror.h:29,
                 from /usr/include/glib-2.0/glib/gunicode.h:28,
                 from ../../gfc/glib/unicode.hh:30,
                 from ../../gfc/utfstring.hh:29,
                 from ../../gfc/trackable.hh:38,
                 from ../../gfc/object.hh:28,
                 from asyncqueue.hh:28,
                 from asyncqueue.cc:21:
/usr/include/glib-2.0/glib/gtypes.h:29:2: error: #error "Only <glib.h> can be included directly."
 #error "Only <glib.h> can be included directly."
  ^
In file included from /usr/lib/arm-linux-gnueabihf/glib-2.0/include/glibconfig.h:9:0,
                 from /usr/include/glib-2.0/glib/gtypes.h:32,
                 from /usr/include/glib-2.0/glib/gquark.h:32,
                 from /usr/include/glib-2.0/glib/gerror.h:29,
                 from /usr/include/glib-2.0/glib/gunicode.h:28,
                 from ../../gfc/glib/unicode.hh:30,
                 from ../../gfc/utfstring.hh:29,
                 from ../../gfc/trackable.hh:38,
                 from ../../gfc/object.hh:28,
                 from asyncqueue.hh:28,
                 from asyncqueue.cc:21:
/usr/include/glib-2.0/glib/gmacros.h:33:2: error: #error "Only <glib.h> can be included directly."
 #error "Only <glib.h> can be included directly."
  ^
In file included from /usr/include/glib-2.0/glib/gtypes.h:34:0,
                 from /usr/include/glib-2.0/glib/gquark.h:32,
                 from /usr/include/glib-2.0/glib/gerror.h:29,
                 from /usr/include/glib-2.0/glib/gunicode.h:28,
                 from ../../gfc/glib/unicode.hh:30,
                 from ../../gfc/utfstring.hh:29,
                 from ../../gfc/trackable.hh:38,
                 from ../../gfc/object.hh:28,
                 from asyncqueue.hh:28,
                 from asyncqueue.cc:21:
/usr/include/glib-2.0/glib/gversionmacros.h:29:2: error: #error "Only <glib.h> can be included directly."
 #error "Only <glib.h> can be included directly."
  ^
In file included from asyncqueue.hh:32:0,
                 from asyncqueue.cc:21:
/usr/include/glib-2.0/glib/gasyncqueue.h:29:2: error: #error "Only <glib.h> can be included directly."
 #error "Only <glib.h> can be included directly."
  ^
In file included from /usr/include/glib-2.0/glib/gasyncqueue.h:32:0,
                 from asyncqueue.hh:32,
                 from asyncqueue.cc:21:
/usr/include/glib-2.0/glib/gthread.h:29:2: error: #error "Only <glib.h> can be included directly."
 #error "Only <glib.h> can be included directly."
  ^
In file included from /usr/include/glib-2.0/glib/gthread.h:32:0,
                 from /usr/include/glib-2.0/glib/gasyncqueue.h:32,
                 from asyncqueue.hh:32,
                 from asyncqueue.cc:21:
/usr/include/glib-2.0/glib/gatomic.h:24:2: error: #error "Only <glib.h> can be included directly."
 #error "Only <glib.h> can be included directly."
  ^
asyncqueue.cc: In member function 'void* GFC::G::AsyncQueue::timed_pop(GFC::G::TimeVal*)':
asyncqueue.cc:101:19: warning: 'void* g_async_queue_timed_pop_unlocked(GAsyncQueue*, GTimeVal*)' is deprecated (declared at /usr/include/glib-2.0/glib/gasyncqueue.h:104): Use 'g_async_queue_timeout_pop_unlocked' instead [-Wdeprecated-declarations]
  return locked_ ? g_async_queue_timed_pop_unlocked(queue_, *end_time) : g_async_queue_timed_pop(queue_, *end_time);
                   ^
asyncqueue.cc:101:69: warning: 'void* g_async_queue_timed_pop_unlocked(GAsyncQueue*, GTimeVal*)' is deprecated (declared at /usr/include/glib-2.0/glib/gasyncqueue.h:104): Use 'g_async_queue_timeout_pop_unlocked' instead [-Wdeprecated-declarations]
  return locked_ ? g_async_queue_timed_pop_unlocked(queue_, *end_time) : g_async_queue_timed_pop(queue_, *end_time);
                                                                     ^
asyncqueue.cc:101:73: warning: 'void* g_async_queue_timed_pop(GAsyncQueue*, GTimeVal*)' is deprecated (declared at /usr/include/glib-2.0/glib/gasyncqueue.h:101): Use 'g_async_queue_timeout_pop' instead [-Wdeprecated-declarations]
  return locked_ ? g_async_queue_timed_pop_unlocked(queue_, *end_time) : g_async_queue_timed_pop(queue_, *end_time);
                                                                         ^
asyncqueue.cc:101:114: warning: 'void* g_async_queue_timed_pop(GAsyncQueue*, GTimeVal*)' is deprecated (declared at /usr/include/glib-2.0/glib/gasyncqueue.h:101): Use 'g_async_queue_timeout_pop' instead [-Wdeprecated-declarations]
  return locked_ ? g_async_queue_timed_pop_unlocked(queue_, *end_time) : g_async_queue_timed_pop(queue_, *end_time);
                                                                                                                  ^
Makefile:395: recipe for target 'asyncqueue.lo' failed
make[5]: *** [asyncqueue.lo] Error 1
make[5]: Leaving directory '/<<PKGBUILDDIR>>/gfc/glib'
Makefile:431: recipe for target 'all-recursive' failed
make[4]: *** [all-recursive] Error 1
make[4]: Leaving directory '/<<PKGBUILDDIR>>/gfc/glib'
Makefile:370: recipe for target 'all-recursive' failed
make[3]: *** [all-recursive] Error 1
make[3]: Leaving directory '/<<PKGBUILDDIR>>/gfc'
Makefile:305: recipe for target 'all-recursive' failed
make[2]: *** [all-recursive] Error 1
make[2]: Leaving directory '/<<PKGBUILDDIR>>'
Makefile:198: recipe for target 'all' failed
make[1]: *** [all] Error 2
make[1]: Leaving directory '/<<PKGBUILDDIR>>'
/usr/share/cdbs/1/class/makefile.mk:47: recipe for target 'debian/stamp-makefile-build' failed
make: *** [debian/stamp-makefile-build] Error 2
dpkg-buildpackage: error: debian/rules build-arch gave error exit status 2
--------------------------------------------------------------------------------
Build finished at 2017-06-18T08:10:36Z

Finished
--------


+------------------------------------------------------------------------------+
| Cleanup                                                                      |
+------------------------------------------------------------------------------+

Purging /<<BUILDDIR>>
Not cleaning session: cloned chroot in use
E: Build failure (dpkg-buildpackage died)

+------------------------------------------------------------------------------+
| Summary                                                                      |
+------------------------------------------------------------------------------+

Build Architecture: armhf
Build-Space: 6660
Build-Time: 24
Distribution: jessie-staging
Fail-Stage: build
Host Architecture: armhf
Install-Time: 121
Job: gfccore_2.3.1-7.1
Machine Architecture: armhf
Package: gfccore
Package-Time: 168
Source-Version: 2.3.1-7.1
Space: 6660
Status: attempted
Version: 2.3.1-7.1
--------------------------------------------------------------------------------
Finished at 2017-06-18T08:10:36Z
Build needed 00:02:48, 6660k disk space