Raspbian Package Auto-Building

Build log for cde (0.1+git9-g551e54d-1) on armhf

cde0.1+git9-g551e54d-1armhf → 2014-11-27 01:12:23

sbuild (Debian sbuild) 0.63.2 (18 Aug 2012) on bm-wb-04

║ cde 0.1+git9-g551e54d-1 (armhf)                            27 Nov 2014 01:06 ║

Package: cde
Version: 0.1+git9-g551e54d-1
Source Version: 0.1+git9-g551e54d-1
Distribution: jessie-staging
Machine Architecture: armhf
Host Architecture: armhf
Build Architecture: armhf

I: NOTICE: Log filtering will replace 'build/cde-ph2x8s/cde-0.1+git9-g551e54d' with '«PKGBUILDDIR»'
I: NOTICE: Log filtering will replace 'build/cde-ph2x8s' with '«BUILDDIR»'
I: NOTICE: Log filtering will replace 'var/lib/schroot/mount/jessie-staging-armhf-sbuild-6d523ffd-da53-4bcb-aedf-f5cbdc21dec2' with '«CHROOT»'

│ Update chroot                                                                │

Get:1 jessie-staging InRelease [11.3 kB]
Get:2 jessie-staging/main Sources [7716 kB]
Get:3 jessie-staging/main armhf Packages [8942 kB]
Ign jessie-staging/main Translation-en
Fetched 16.7 MB in 30s (542 kB/s)
Reading package lists...

│ Fetch source files                                                           │

Check APT

Checking available source versions...

Download source files with APT

Reading package lists...
Building dependency tree...
Reading state information...
NOTICE: 'cde' packaging is maintained in the 'Git' version control system at:
Need to get 2402 kB of source archives.
Get:1 jessie-staging/main cde 0.1+git9-g551e54d-1 (dsc) [1439 B]
Get:2 jessie-staging/main cde 0.1+git9-g551e54d-1 (tar) [2395 kB]
Get:3 jessie-staging/main cde 0.1+git9-g551e54d-1 (diff) [6199 B]
Fetched 2402 kB in 0s (3822 kB/s)
Download complete and in download only mode

Check arch

Merged Build-Depends: build-essential, fakeroot
Filtered Build-Depends: build-essential, fakeroot
dpkg-deb: building package `sbuild-build-depends-core-dummy' in `/«BUILDDIR»/resolver-ZPqNVu/apt_archive/sbuild-build-depends-core-dummy.deb'.
Reading package lists...

│ Install core build dependencies (apt-based resolver)                         │

Installing build dependencies
Reading package lists...
Building dependency tree...
Reading state information...
The following NEW packages will be installed:
debconf: delaying package configuration, since apt-utils is not installed
0 upgraded, 1 newly installed, 0 to remove and 71 not upgraded.
Need to get 0 B/818 B of archives.
After this operation, 0 B of additional disk space will be used.
Selecting previously unselected package sbuild-build-depends-core-dummy.
(Reading database ... 11075 files and directories currently installed.)
Preparing to unpack .../sbuild-build-depends-core-dummy.deb ...
Unpacking sbuild-build-depends-core-dummy (0.invalid.0) ...
Setting up sbuild-build-depends-core-dummy (0.invalid.0) ...
Merged Build-Depends: libc6-dev | libc-dev, gcc (>= 4:4.9.1), g++ (>= 4:4.9.1), make, dpkg-dev (>= 1.17.11), debhelper (>= 7.0.50~)
Filtered Build-Depends: libc6-dev, gcc (>= 4:4.9.1), g++ (>= 4:4.9.1), make, dpkg-dev (>= 1.17.11), debhelper (>= 7.0.50~)
dpkg-deb: building package `sbuild-build-depends-cde-dummy' in `/«BUILDDIR»/resolver-XrEpoz/apt_archive/sbuild-build-depends-cde-dummy.deb'.
Reading package lists...

│ Install cde build dependencies (apt-based resolver)                          │

Installing build dependencies
Reading package lists...
Building dependency tree...
Reading state information...
The following extra packages will be installed:
  bsdmainutils debhelper dpkg-dev file gettext gettext-base groff-base
  intltool-debian libasprintf0c2 libcroco3 libdpkg-perl libffi6 libglib2.0-0
  libmagic1 libpipeline1 libunistring0 libxml2 man-db po-debconf
Suggested packages:
  wamerican wordlist whois vacation dh-make debian-keyring gettext-doc groff
  less www-browser libmail-box-perl
Recommended packages:
  libalgorithm-merge-perl curl wget lynx-cur autopoint libasprintf-dev
  libgettextpo-dev libfile-fcntllock-perl libglib2.0-data shared-mime-info
  xdg-user-dirs xml-core libmail-sendmail-perl
The following NEW packages will be installed:
  bsdmainutils debhelper file gettext gettext-base groff-base intltool-debian
  libasprintf0c2 libcroco3 libffi6 libglib2.0-0 libmagic1 libpipeline1
  libunistring0 libxml2 man-db po-debconf sbuild-build-depends-cde-dummy
The following packages will be upgraded:
  dpkg-dev libdpkg-perl
2 upgraded, 18 newly installed, 0 to remove and 69 not upgraded.
Need to get 10.9 MB/10.9 MB of archives.
After this operation, 23.9 MB of additional disk space will be used.
Get:1 jessie-staging/main libpipeline1 armhf 1.4.0-1 [24.0 kB]
Get:2 jessie-staging/main groff-base armhf 1.22.2-8 [1045 kB]
Get:3 jessie-staging/main bsdmainutils armhf 9.0.6 [177 kB]
Get:4 jessie-staging/main man-db armhf [972 kB]
Get:5 jessie-staging/main libasprintf0c2 armhf 0.19.3-1 [30.9 kB]
Get:6 jessie-staging/main libmagic1 armhf 1:5.20-2 [239 kB]
Get:7 jessie-staging/main libxml2 armhf 2.9.1+dfsg1-4 [698 kB]
Get:8 jessie-staging/main libffi6 armhf 3.1-2 [18.1 kB]
Get:9 jessie-staging/main libglib2.0-0 armhf 2.42.0-2 [2333 kB]
Get:10 jessie-staging/main libcroco3 armhf 0.6.8-3 [121 kB]
Get:11 jessie-staging/main libunistring0 armhf 0.9.3-5.2 [253 kB]
Get:12 jessie-staging/main file armhf 1:5.20-2 [58.0 kB]
Get:13 jessie-staging/main gettext-base armhf 0.19.3-1 [116 kB]
Get:14 jessie-staging/main dpkg-dev all 1.17.21 [1502 kB]
Get:15 jessie-staging/main libdpkg-perl all 1.17.21 [1038 kB]
Get:16 jessie-staging/main gettext armhf 0.19.3-1 [1168 kB]
Get:17 jessie-staging/main intltool-debian all 0.35.0+20060710.1 [29.8 kB]
Get:18 jessie-staging/main po-debconf all 1.0.16+nmu3 [220 kB]
Get:19 jessie-staging/main debhelper all 9.20141022 [812 kB]
debconf: delaying package configuration, since apt-utils is not installed
Fetched 10.9 MB in 2s (3697 kB/s)
Selecting previously unselected package libpipeline1:armhf.
(Reading database ... 11075 files and directories currently installed.)
Preparing to unpack .../libpipeline1_1.4.0-1_armhf.deb ...
Unpacking libpipeline1:armhf (1.4.0-1) ...
Selecting previously unselected package groff-base.
Preparing to unpack .../groff-base_1.22.2-8_armhf.deb ...
Unpacking groff-base (1.22.2-8) ...
Selecting previously unselected package bsdmainutils.
Preparing to unpack .../bsdmainutils_9.0.6_armhf.deb ...
Unpacking bsdmainutils (9.0.6) ...
Selecting previously unselected package man-db.
Preparing to unpack .../man-db_2.7.0.2-3_armhf.deb ...
Unpacking man-db ( ...
Selecting previously unselected package libasprintf0c2:armhf.
Preparing to unpack .../libasprintf0c2_0.19.3-1_armhf.deb ...
Unpacking libasprintf0c2:armhf (0.19.3-1) ...
Selecting previously unselected package libmagic1:armhf.
Preparing to unpack .../libmagic1_1%3a5.20-2_armhf.deb ...
Unpacking libmagic1:armhf (1:5.20-2) ...
Selecting previously unselected package libxml2:armhf.
Preparing to unpack .../libxml2_2.9.1+dfsg1-4_armhf.deb ...
Unpacking libxml2:armhf (2.9.1+dfsg1-4) ...
Selecting previously unselected package libffi6:armhf.
Preparing to unpack .../libffi6_3.1-2_armhf.deb ...
Unpacking libffi6:armhf (3.1-2) ...
Selecting previously unselected package libglib2.0-0:armhf.
Preparing to unpack .../libglib2.0-0_2.42.0-2_armhf.deb ...
Unpacking libglib2.0-0:armhf (2.42.0-2) ...
Selecting previously unselected package libcroco3:armhf.
Preparing to unpack .../libcroco3_0.6.8-3_armhf.deb ...
Unpacking libcroco3:armhf (0.6.8-3) ...
Selecting previously unselected package libunistring0:armhf.
Preparing to unpack .../libunistring0_0.9.3-5.2_armhf.deb ...
Unpacking libunistring0:armhf (0.9.3-5.2) ...
Selecting previously unselected package file.
Preparing to unpack .../file_1%3a5.20-2_armhf.deb ...
Unpacking file (1:5.20-2) ...
Selecting previously unselected package gettext-base.
Preparing to unpack .../gettext-base_0.19.3-1_armhf.deb ...
Unpacking gettext-base (0.19.3-1) ...
Preparing to unpack .../dpkg-dev_1.17.21_all.deb ...
Unpacking dpkg-dev (1.17.21) over (1.17.13) ...
Preparing to unpack .../libdpkg-perl_1.17.21_all.deb ...
Unpacking libdpkg-perl (1.17.21) over (1.17.13) ...
Selecting previously unselected package gettext.
Preparing to unpack .../gettext_0.19.3-1_armhf.deb ...
Unpacking gettext (0.19.3-1) ...
Selecting previously unselected package intltool-debian.
Preparing to unpack .../intltool-debian_0.35.0+20060710.1_all.deb ...
Unpacking intltool-debian (0.35.0+20060710.1) ...
Selecting previously unselected package po-debconf.
Preparing to unpack .../po-debconf_1.0.16+nmu3_all.deb ...
Unpacking po-debconf (1.0.16+nmu3) ...
Selecting previously unselected package debhelper.
Preparing to unpack .../debhelper_9.20141022_all.deb ...
Unpacking debhelper (9.20141022) ...
Selecting previously unselected package sbuild-build-depends-cde-dummy.
Preparing to unpack .../sbuild-build-depends-cde-dummy.deb ...
Unpacking sbuild-build-depends-cde-dummy (0.invalid.0) ...
Setting up libpipeline1:armhf (1.4.0-1) ...
Setting up groff-base (1.22.2-8) ...
Setting up bsdmainutils (9.0.6) ...
update-alternatives: using /usr/bin/bsd-write to provide /usr/bin/write (write) in auto mode
update-alternatives: using /usr/bin/bsd-from to provide /usr/bin/from (from) in auto mode
Setting up man-db ( ...
Not building database; man-db/auto-update is not 'true'.
Setting up libasprintf0c2:armhf (0.19.3-1) ...
Setting up libmagic1:armhf (1:5.20-2) ...
Setting up libxml2:armhf (2.9.1+dfsg1-4) ...
Setting up libffi6:armhf (3.1-2) ...
Setting up libglib2.0-0:armhf (2.42.0-2) ...
No schema files found: doing nothing.
Setting up libcroco3:armhf (0.6.8-3) ...
Setting up libunistring0:armhf (0.9.3-5.2) ...
Setting up file (1:5.20-2) ...
Setting up gettext-base (0.19.3-1) ...
Setting up libdpkg-perl (1.17.21) ...
Setting up dpkg-dev (1.17.21) ...
Setting up gettext (0.19.3-1) ...
Setting up intltool-debian (0.35.0+20060710.1) ...
Setting up po-debconf (1.0.16+nmu3) ...
Setting up debhelper (9.20141022) ...
Setting up sbuild-build-depends-cde-dummy (0.invalid.0) ...
Processing triggers for libc-bin (2.19-11) ...

│ Build environment                                                            │

Kernel: Linux 3.17-1-armmp armhf (armv7l)
Toolchain package versions: binutils_2.24.51.20140918-1 dpkg-dev_1.17.21 g++-4.9_4.9.1-15 gcc-4.8_4.8.3-11 gcc-4.9_4.9.1-15 libc6-dev_2.19-11 libstdc++-4.9-dev_4.9.1-15 libstdc++6_4.9.1-15 linux-libc-dev_3.14.4-1+rpi1+b4
Package versions: apt_1.0.9.1 base-files_7.5+rpi1 base-passwd_3.5.36 bash_4.3-9.2 binutils_2.24.51.20140918-1 bsdmainutils_9.0.6 bsdutils_1:2.20.1-5.9 build-essential_11.7 bzip2_1.0.6-7 coreutils_8.23-2 cpio_2.11+dfsg-2 cpp_4:4.9.1-1 cpp-4.8_4.8.3-11 cpp-4.9_4.9.1-15 dash_0.5.7-4 debconf_1.5.53 debfoster_2.7-2 debhelper_9.20141022 debianutils_4.4 diffutils_1:3.3-1 dpkg_1.17.13 dpkg-dev_1.17.21 e2fslibs_1.42.12-1 e2fsprogs_1.42.12-1 fakeroot_1.20.1-1.1 file_1:5.20-2 findutils_4.4.2-9 g++_4:4.9.1-1 g++-4.9_4.9.1-15 gcc_4:4.9.1-1 gcc-4.5-base_4.5.3-12+rpi1 gcc-4.6-base_4.6.4-5+rpi1 gcc-4.7-base_4.7.3-11+rpi1 gcc-4.8_4.8.3-11 gcc-4.8-base_4.8.3-11 gcc-4.9_4.9.1-15 gcc-4.9-base_4.9.1-15 gettext_0.19.3-1 gettext-base_0.19.3-1 gnupg_1.4.18-4 gpgv_1.4.18-4 grep_2.20-3 groff-base_1.22.2-8 gzip_1.6-3 hostname_3.15 init_1.21 initramfs-tools_0.116 initscripts_2.88dsf-53.4 insserv_1.14.0-5 intltool-debian_0.35.0+20060710.1 klibc-utils_2.0.3-1+rpi1 kmod_18-3 libacl1_2.2.52-2 libapt-pkg4.12_1.0.9.1 libasan0_4.8.3-11 libasan1_4.9.1-15 libasprintf0c2_0.19.3-1 libatomic1_4.9.1-15 libattr1_1:2.4.47-2 libaudit-common_1:2.4-1 libaudit1_1:2.4-1 libblkid1_2.20.1-5.9 libbz2-1.0_1.0.6-7 libc-bin_2.19-11 libc-dev-bin_2.19-11 libc6_2.19-11 libc6-dev_2.19-11 libcap2_1:2.24-6 libcgi-pm-perl_4.03-1 libcloog-isl4_0.18.2-1 libcomerr2_1.42.12-1 libcroco3_0.6.8-3 libdb5.1_5.1.29-6 libdb5.3_5.3.28-6 libdbus-1-3_1.8.6-2 libdebconfclient0_0.192 libdpkg-perl_1.17.21 libdrm2_2.4.56-1 libfakeroot_1.20.1-1.1 libffi6_3.1-2 libgc1c2_1:7.2d-6.3 libgcc-4.8-dev_4.8.3-11 libgcc-4.9-dev_4.9.1-15 libgcc1_1:4.9.1-15 libgdbm3_1.8.3-13 libglib2.0-0_2.42.0-2 libgmp10_2:6.0.0+dfsg-4+rpi1 libgomp1_4.9.1-15 libisl10_0.12.2-2 libklibc_2.0.3-1+rpi1 libkmod2_18-3 liblzma5_5.1.1alpha+20120614-2 libmagic1_1:5.20-2 libmount1_2.20.1-5.9 libmpc3_1.0.2-1 libmpfr4_3.1.2-1 libncurses5_5.9+20140913-1 libncursesw5_5.9+20140913-1 libpackage-constants-perl_0.04-1 libpam-modules_1.1.8-3.1 libpam-modules-bin_1.1.8-3.1 libpam-runtime_1.1.8-3.1 libpam0g_1.1.8-3.1 libpcre3_1:8.35-3 libpipeline1_1.4.0-1 libpng12-0_1.2.50-2 libprocps0_1:3.3.4-2 libprocps3_1:3.3.9-7 libreadline6_6.3-8 libselinux1_2.3-2 libsemanage-common_2.3-1 libsemanage1_2.3-1 libsepol1_2.3-2 libslang2_2.3.0-1 libss2_1.42.12-1 libstdc++-4.9-dev_4.9.1-15 libstdc++6_4.9.1-15 libtimedate-perl_2.3000-2 libtinfo5_5.9+20140913-1 libubsan0_4.9.1-15 libudev1_208-8 libunistring0_0.9.3-5.2 libusb-0.1-4_2:0.1.12-24 libustr-1.0-1_1.0.4-3 libuuid1_2.20.1-5.9 libxml2_2.9.1+dfsg1-4 linux-libc-dev_3.14.4-1+rpi1+b4 login_1:4.2-2 lsb-base_4.1+Debian13+rpi1 make_4.0-8 makedev_2.3.1-93 man-db_2.7.0.2-3 mawk_1.3.3-17 mount_2.20.1-5.9 multiarch-support_2.19-11 nano_2.2.6-3 ncurses-base_5.9+20140913-1 ncurses-bin_5.9+20140913-1 passwd_1:4.2-2 patch_2.7.1-6 perl_5.20.1-1 perl-base_5.20.1-1 perl-modules_5.20.1-1 plymouth_0.9.0-7 po-debconf_1.0.16+nmu3 procps_1:3.3.9-7 raspbian-archive-keyring_20120528.2 readline-common_6.3-8 sbuild-build-depends-cde-dummy_0.invalid.0 sbuild-build-depends-core-dummy_0.invalid.0 sed_4.2.2-4 sensible-utils_0.0.9 startpar_0.59-3 sysv-rc_2.88dsf-53.4 sysvinit_2.88dsf-53.4 sysvinit-core_2.88dsf-53.4 sysvinit-utils_2.88dsf-53.4 tar_1.27.1-2 tzdata_2014g-1 udev_208-8 util-linux_2.20.1-5.9 xz-utils_5.1.1alpha+20120614-2 zlib1g_1:1.2.8.dfsg-1+rpi1

│ Build                                                                        │

Unpack source

gpgv: keyblock resource `/sbuild-nonexistent/.gnupg/trustedkeys.gpg': file open error
gpgv: Signature made Mon Nov 18 23:54:16 2013 UTC using DSA key ID 75C024C8
gpgv: Can't check signature: public key not found
dpkg-source: warning: failed to verify signature on ./cde_0.1+git9-g551e54d-1.dsc
dpkg-source: info: extracting cde in cde-0.1+git9-g551e54d
dpkg-source: info: unpacking cde_0.1+git9-g551e54d.orig.tar.gz
dpkg-source: info: unpacking cde_0.1+git9-g551e54d-1.debian.tar.gz
dpkg-source: info: applying up_ignore-noMakefile_on_clean
dpkg-source: info: applying deb_install_usr

Check disc space

Sufficient free space for build

User Environment

SSH_CLIENT= 39329 22


dpkg-buildpackage: source package cde
dpkg-buildpackage: source version 0.1+git9-g551e54d-1
dpkg-buildpackage: source distribution unstable
 dpkg-source --before-build cde-0.1+git9-g551e54d
dpkg-buildpackage: host architecture armhf
dpkg-source: info: using options from cde-0.1+git9-g551e54d/debian/source/options: --extend-diff-ignore=(^|/)(\.gitattributes|.*\.tar\..*)$
 fakeroot debian/rules clean
dh clean
   debian/rules override_dh_auto_clean
make[1]: Entering directory '/«BUILDDIR»/cde-0.1+git9-g551e54d'
dh_auto_clean override_dh_auto_clean
	make -j1 clean
make[2]: Entering directory '/«BUILDDIR»/cde-0.1+git9-g551e54d'
cd readelf-mini && make clean
make[3]: Entering directory '/«BUILDDIR»/cde-0.1+git9-g551e54d/readelf-mini'
rm -f libreadelf-mini.a readelf-mini *.o
make[3]: Leaving directory '/«BUILDDIR»/cde-0.1+git9-g551e54d/readelf-mini'
cd strace-4.6 && make clean
make[3]: Entering directory '/«BUILDDIR»/cde-0.1+git9-g551e54d/strace-4.6'
make[3]: *** No rule to make target 'clean'.  Stop.
make[3]: Leaving directory '/«BUILDDIR»/cde-0.1+git9-g551e54d/strace-4.6'
make[2]: [clean] Error 2 (ignored)
Makefile:18: recipe for target 'clean' failed
rm -f cde cde-exec okapi
make[2]: Leaving directory '/«BUILDDIR»/cde-0.1+git9-g551e54d'
I: distcleaning in strace-4.6
cd strace-4.6 && make distclean
make[2]: Entering directory '/«BUILDDIR»/cde-0.1+git9-g551e54d/strace-4.6'
make[2]: warning: jobserver unavailable: using -j1.  Add '+' to parent make rule.
make[2]: *** No rule to make target 'distclean'.  Stop.
make[2]: Leaving directory '/«BUILDDIR»/cde-0.1+git9-g551e54d/strace-4.6'
make[1]: [override_dh_auto_clean] Error 2 (ignored)
debian/rules:51: recipe for target 'override_dh_auto_clean' failed
make[1]: Leaving directory '/«BUILDDIR»/cde-0.1+git9-g551e54d'
	rm -f debian/cde.substvars
	rm -f debian/cde.*.debhelper
	rm -rf debian/cde/
	rm -f debian/*.debhelper.log
	rm -f debian/files
	find .  \( \( \
		\( -path .\*/.git -o -path .\*/.svn -o -path .\*/.bzr -o -path .\*/.hg -o -path .\*/CVS \) -prune -o -type f -a \
	        \( -name '#*#' -o -name '.*~' -o -name '*~' -o -name DEADJOE \
		 -o -name '*.orig' -o -name '*.rej' -o -name '*.bak' \
		 -o -name '.*.orig' -o -name .*.rej -o -name '.SUMS' \
		 -o -name TAGS -o \( -path '*/.deps/*' -a -name '*.P' \) \
		\) -exec rm -f {} + \) -o \
		\( -type d -a -name autom4te.cache -prune -exec rm -rf {} + \) \)
	rm -f *-stamp
 debian/rules build-arch
dh build-arch
   dh_testdir -a
   debian/rules override_dh_auto_configure
make[1]: Entering directory '/«BUILDDIR»/cde-0.1+git9-g551e54d'
dh_auto_configure override_dh_auto_configure
: # Need to generate strace-4.6/Makefile with proper architecture specs
: # otherwise build would fail on 32/64 kernel with 32bit userland
cd strace-4.6; \
	sh ./configure --prefix=/usr --build=arm-linux-gnueabihf
checking for a BSD-compatible install... /usr/bin/install -c
checking whether build environment is sane... yes
checking for a thread-safe mkdir -p... /bin/mkdir -p
checking for gawk... no
checking for mawk... mawk
checking whether make sets $(MAKE)... yes
checking whether to enable maintainer-specific portions of Makefiles... no
checking build system type... arm-unknown-linux-gnueabihf
checking host system type... arm-unknown-linux-gnueabihf
checking for supported operating system... linux
checking for supported architecture... arm
checking for gcc... gcc
checking whether the C compiler works... yes
checking for C compiler default output file name... a.out
checking for suffix of executables... 
checking whether we are cross compiling... no
checking for suffix of object files... o
checking whether we are using the GNU C compiler... yes
checking whether gcc accepts -g... yes
checking for gcc option to accept ISO C89... none needed
checking for style of include used by make... GNU
checking dependency style of gcc... gcc3
checking how to run the C preprocessor... gcc -E
checking for grep that handles long lines and -e... /bin/grep
checking for egrep... /bin/grep -E
checking for ANSI C header files... yes
checking for sys/types.h... yes
checking for sys/stat.h... yes
checking for stdlib.h... yes
checking for string.h... yes
checking for memory.h... yes
checking for strings.h... yes
checking for inttypes.h... yes
checking for stdint.h... yes
checking for unistd.h... yes
checking minix/config.h usability... no
checking minix/config.h presence... no
checking for minix/config.h... no
checking whether it is safe to define __EXTENSIONS__... yes
checking for primary include directory... /usr/include
checking whether compiler handles -Wall... yes
checking whether compiler handles -Wwrite-strings... yes
checking how to run the C preprocessor... gcc -E
checking whether gcc needs -traditional... no
checking for an ANSI C-conforming const... yes
checking whether byte ordering is bigendian... no
checking for ANSI C header files... (cached) yes
checking for stdbool.h that conforms to C99... yes
checking for _Bool... yes
checking for dirent.h that defines DIR... yes
checking for library containing opendir... none required
checking whether stat file-mode macros are broken... no
checking for struct stat.st_blksize... yes
checking for struct stat.st_blocks... yes
checking for struct stat.st_aclcnt... no
checking for struct stat.st_flags... no
checking for struct stat.st_fstype... no
checking for struct stat.st_gen... no
checking for struct stat.st_level... no
checking for struct stat.st_rdev... yes
checking for stat64 in (asm|sys)/stat.h... yes
checking for statfs64 in sys/vfs.h... yes
checking return type of signal handlers... void
checking for uid_t in sys/types.h... yes
checking for mode_t... yes
checking type of array argument to getgroups... gid_t
checking whether sys/types.h defines makedev... yes
checking for sig_atomic_t... yes
checking for siginfo_t... yes
checking for struct sockaddr_in6.sin6_scope_id... yes
checking for long long... yes
checking for little endian long long... yes
checking for long long off_t... no
checking for long long rlim_t... no
checking for struct opthdr... no
checking for struct t_opthdr... no
checking for fork... yes
checking for getdents... no
checking for if_indextoname... yes
checking for inet_ntop... yes
checking for mctl... no
checking for prctl... yes
checking for pread... yes
checking for sendmsg... yes
checking for sigaction... yes
checking for strerror... yes
checking for strsignal... yes
checking for sys_siglist... yes
checking for _sys_siglist... yes
checking for inttypes.h... (cached) yes
checking ioctls.h usability... no
checking ioctls.h presence... no
checking for ioctls.h... no
checking libaio.h usability... no
checking libaio.h presence... no
checking for libaio.h... no
checking mqueue.h usability... yes
checking mqueue.h presence... yes
checking for mqueue.h... yes
checking poll.h usability... yes
checking poll.h presence... yes
checking for poll.h... yes
checking stropts.h usability... yes
checking stropts.h presence... yes
checking for stropts.h... yes
checking termio.h usability... yes
checking termio.h presence... yes
checking for termio.h... yes
checking sys/acl.h usability... no
checking sys/acl.h presence... no
checking for sys/acl.h... no
checking sys/aio.h usability... no
checking sys/aio.h presence... no
checking for sys/aio.h... no
checking sys/asynch.h usability... no
checking sys/asynch.h presence... no
checking for sys/asynch.h... no
checking sys/conf.h usability... no
checking sys/conf.h presence... no
checking for sys/conf.h... no
checking sys/door.h usability... no
checking sys/door.h presence... no
checking for sys/door.h... no
checking sys/epoll.h usability... yes
checking sys/epoll.h presence... yes
checking for sys/epoll.h... yes
checking sys/filio.h usability... no
checking sys/filio.h presence... no
checking for sys/filio.h... no
checking sys/ioctl.h usability... yes
checking sys/ioctl.h presence... yes
checking for sys/ioctl.h... yes
checking sys/nscsys.h usability... no
checking sys/nscsys.h presence... no
checking for sys/nscsys.h... no
checking sys/poll.h usability... yes
checking sys/poll.h presence... yes
checking for sys/poll.h... yes
checking sys/ptrace.h usability... yes
checking sys/ptrace.h presence... yes
checking for sys/ptrace.h... yes
checking sys/reg.h usability... no
checking sys/reg.h presence... no
checking for sys/reg.h... no
checking sys/stream.h usability... no
checking sys/stream.h presence... no
checking for sys/stream.h... no
checking sys/sysconfig.h usability... no
checking sys/sysconfig.h presence... no
checking for sys/sysconfig.h... no
checking sys/tihdr.h usability... no
checking sys/tihdr.h presence... no
checking for sys/tihdr.h... no
checking sys/tiuser.h usability... no
checking sys/tiuser.h presence... no
checking for sys/tiuser.h... no
checking sys/uio.h usability... yes
checking sys/uio.h presence... yes
checking for sys/uio.h... yes
checking sys/vfs.h usability... yes
checking sys/vfs.h presence... yes
checking for sys/vfs.h... yes
checking asm/cachectl.h usability... no
checking asm/cachectl.h presence... no
checking for asm/cachectl.h... no
checking asm/sysmips.h usability... no
checking asm/sysmips.h presence... no
checking for asm/sysmips.h... no
checking linux/capability.h usability... yes
checking linux/capability.h presence... yes
checking for linux/capability.h... yes
checking linux/ptrace.h usability... yes
checking linux/ptrace.h presence... yes
checking for linux/ptrace.h... yes
checking linux/utsname.h usability... yes
checking linux/utsname.h presence... yes
checking for linux/utsname.h... yes
checking netinet/sctp.h usability... no
checking netinet/sctp.h presence... no
checking for netinet/sctp.h... no
checking for linux/icmp.h... yes
checking for linux/in6.h... yes
checking for linux/netlink.h... yes
checking for linux/if_packet.h... yes
checking for asm/sigcontext.h... yes
checking for struct sigcontext_struct... yes
checking for struct sigcontext... yes
checking for netinet/tcp.h... yes
checking for netinet/udp.h... yes
checking for MP procfs... no
checking for pollable procfs... no
checking for struct msghdr.msg_control... yes
checking for pr_syscall in struct prstatus... no
checking for struct T_conn_res.QUEUE_ptr... no
checking for struct T_conn_res.ACCEPTOR_id... no
checking for struct __old_kernel_stat... yes
checking for struct pt_all_user_regs... no
checking for struct ia64_fpreg... no
checking for struct user_desc... no
checking for struct dqblk.dqb_curblocks... no
checking for struct sigcontext.sc_hi2... no
checking whether sys_errlist is declared... yes
checking whether sys_siglist is declared... yes
checking whether _sys_siglist is declared... yes
checking whether 		PTRACE_SETOPTIONS is declared... yes
checking whether 		PTRACE_GETEVENTMSG is declared... yes
checking whether 		PTRACE_GETSIGINFO is declared... yes
checking whether 		PTRACE_O_TRACEFORK is declared... yes
checking whether 		PTRACE_O_TRACEVFORK is declared... yes
checking whether 		PTRACE_O_TRACECLONE is declared... yes
checking whether 		PTRACE_EVENT_FORK is declared... yes
checking whether 		PTRACE_EVENT_VFORK is declared... yes
checking whether 		PTRACE_EVENT_CLONE is declared... yes
checking for perl... /usr/bin/perl
configure: creating ./config.status
config.status: creating Makefile
config.status: creating tests/Makefile
config.status: creating config.h
config.status: executing depfiles commands
make[1]: Leaving directory '/«BUILDDIR»/cde-0.1+git9-g551e54d'
   dh_auto_build -a
	make -j1
make[1]: Entering directory '/«BUILDDIR»/cde-0.1+git9-g551e54d'
gcc -Wall -g -O2 -D_GNU_SOURCE -DOKAPI_STANDALONE strace-4.6/okapi.c -o okapi
cd readelf-mini && make
make[2]: Entering directory '/«BUILDDIR»/cde-0.1+git9-g551e54d/readelf-mini'
gcc -g -O2 -fno-stack-protector -U_FORTIFY_SOURCE -D_GNU_SOURCE -Wl,--hash-style=both -c -Iinclude -Wall readelf-mini.c -o readelf-mini.o
readelf-mini.c: In function 'print_symbol':
readelf-mini.c:458:7: warning: implicit declaration of function 'isprint' [-Wimplicit-function-declaration]
       while (ISPRINT (* c))
readelf-mini.c: In function 'dump_section_as_strings':
readelf-mini.c:8509:11: warning: variable 'addr' set but not used [-Wunused-but-set-variable]
   bfd_vma addr;
readelf-mini.c: In function 'process_archive':
readelf-mini.c:11306:10: warning: variable 'file_name_size' set but not used [-Wunused-but-set-variable]
   size_t file_name_size;
readelf-mini.c: At top level:
readelf-mini.c:11518:1: warning: 'process_file' defined but not used [-Wunused-function]
 process_file (char * file_name)
gcc -g -O2 -fno-stack-protector -U_FORTIFY_SOURCE -D_GNU_SOURCE -Wl,--hash-style=both -c -Iinclude -Wall version.c -o version.o
gcc -g -O2 -fno-stack-protector -U_FORTIFY_SOURCE -D_GNU_SOURCE -Wl,--hash-style=both -c -Iinclude -Wall unwind-ia64.c -o unwind-ia64.o
gcc -g -O2 -fno-stack-protector -U_FORTIFY_SOURCE -D_GNU_SOURCE -Wl,--hash-style=both -c -Iinclude -Wall dwarf.c -o dwarf.o
dwarf.c: In function 'process_debug_info':
dwarf.c:1899:22: warning: variable 'cu_abbrev_offset_ptr' set but not used [-Wunused-but-set-variable]
       unsigned char *cu_abbrev_offset_ptr;
dwarf.c: In function 'display_debug_lines_decoded':
dwarf.c:2454:20: warning: variable 'prev_line' set but not used [-Wunused-but-set-variable]
       unsigned int prev_line = 0;
dwarf.c: In function 'display_debug_ranges':
dwarf.c:3526:18: warning: variable 'section_end' set but not used [-Wunused-but-set-variable]
   unsigned char *section_end;
ar rcs libreadelf-mini.a readelf-mini.o version.o unwind-ia64.o dwarf.o
make[2]: Leaving directory '/«BUILDDIR»/cde-0.1+git9-g551e54d/readelf-mini'
cd strace-4.6 && make
make[2]: Entering directory '/«BUILDDIR»/cde-0.1+git9-g551e54d/strace-4.6'
/bin/mkdir -p ./linux
cat ./linux/ioctlent.h.in ./linux/arm/ioctlent.h.in | \
	gcc -DHAVE_CONFIG_H -I.  -I./linux/arm -I./linux -I./linux  -Wall -Wwrite-strings -Wl,--hash-style=both  -g -O2 -fno-stack-protector -U_FORTIFY_SOURCE -D_GNU_SOURCE  -E -P - | \
	LC_ALL=C sort -u -k3,3 -k2,2 > linux/ioctlent.h
make  all-recursive
make[3]: Entering directory '/«BUILDDIR»/cde-0.1+git9-g551e54d/strace-4.6'
Making all in tests
make[4]: Entering directory '/«BUILDDIR»/cde-0.1+git9-g551e54d/strace-4.6/tests'
make[4]: Nothing to be done for 'all'.
make[4]: Leaving directory '/«BUILDDIR»/cde-0.1+git9-g551e54d/strace-4.6/tests'
make[4]: Entering directory '/«BUILDDIR»/cde-0.1+git9-g551e54d/strace-4.6'
gcc -DHAVE_CONFIG_H -I.  -I./linux/arm -I./linux -I./linux  -Wall -Wwrite-strings -Wl,--hash-style=both  -g -O2 -fno-stack-protector -U_FORTIFY_SOURCE -D_GNU_SOURCE  -MT strace.o -MD -MP -MF .deps/strace.Tpo -c -o strace.o strace.c
In file included from strace.c:40:0:
defs.h:437:27: error: field 'saved_regs' has incomplete type
   struct user_regs_struct saved_regs;
strace.c: In function 'main':
strace.c:836:9: warning: unused variable 'pid' [-Wunused-variable]
  int c, pid = 0;
strace.c: In function 'trace':
strace.c:2792:15: warning: unused variable 'si' [-Wunused-variable]
     siginfo_t si;
make[4]: *** [strace.o] Error 1
Makefile:543: recipe for target 'strace.o' failed
make[4]: Leaving directory '/«BUILDDIR»/cde-0.1+git9-g551e54d/strace-4.6'
make[3]: *** [all-recursive] Error 1
Makefile:601: recipe for target 'all-recursive' failed
make[3]: Leaving directory '/«BUILDDIR»/cde-0.1+git9-g551e54d/strace-4.6'
make[2]: *** [all] Error 2
Makefile:375: recipe for target 'all' failed
make[2]: Leaving directory '/«BUILDDIR»/cde-0.1+git9-g551e54d/strace-4.6'
make[1]: *** [all] Error 2
dh_auto_build: make -j1 returned exit code 2
Makefile:6: recipe for target 'all' failed
make[1]: Leaving directory '/«BUILDDIR»/cde-0.1+git9-g551e54d'
make: *** [build-arch] Error 2
dpkg-buildpackage: error: debian/rules build-arch gave error exit status 2
debian/rules:38: recipe for target 'build-arch' failed
Build finished at 20141127-0111


E: Build failure (dpkg-buildpackage died)

│ Cleanup                                                                      │

Purging /«BUILDDIR»
Not cleaning session: cloned chroot in use

│ Summary                                                                      │

Build Architecture: armhf
Build-Space: 11824
Build-Time: 104
Distribution: jessie-staging
Fail-Stage: build
Host Architecture: armhf
Install-Time: 185
Job: cde_0.1+git9-g551e54d-1
Machine Architecture: armhf
Package: cde
Package-Time: 342
Source-Version: 0.1+git9-g551e54d-1
Space: 11824
Status: attempted
Version: 0.1+git9-g551e54d-1
Finished at 20141127-0111
Build needed 00:05:42, 11824k disc space