Raspbian Package Auto-Building

Build log for ccls (0.20230717-1) on armhf

ccls0.20230717-1armhf → 2024-02-21 19:05:21

sbuild (Debian sbuild) 0.72.0 (25 Oct 2016) on mb-lxc-02

+==============================================================================+
| ccls 0.20230717-1 (armhf)                    Wed, 21 Feb 2024 18:54:26 +0000 |
+==============================================================================+

Package: ccls
Version: 0.20230717-1
Source Version: 0.20230717-1
Distribution: trixie-staging
Machine Architecture: armhf
Host Architecture: armhf
Build Architecture: armhf

I: NOTICE: Log filtering will replace 'var/lib/schroot/mount/trixie-staging-armhf-sbuild-6d78f7f2-4b37-4dbd-ad80-231e1c615cfe' with '<<CHROOT>>'

+------------------------------------------------------------------------------+
| Update chroot                                                                |
+------------------------------------------------------------------------------+

Get:1 http://172.17.4.1/private trixie-staging InRelease [11.3 kB]
Get:2 http://172.17.4.1/private trixie-staging/main Sources [14.5 MB]
Get:3 http://172.17.4.1/private trixie-staging/main armhf Packages [15.1 MB]
Fetched 29.6 MB in 10s (2977 kB/s)
Reading package lists...
W: No sandbox user '_apt' on the system, can not drop privileges
W: http://172.17.4.1/private/dists/trixie-staging/InRelease: Key is stored in legacy trusted.gpg keyring (/etc/apt/trusted.gpg), see the DEPRECATION section in apt-key(8) for details.

+------------------------------------------------------------------------------+
| Fetch source files                                                           |
+------------------------------------------------------------------------------+


Check APT
---------

Checking available source versions...

Download source files with APT
------------------------------

Reading package lists...
NOTICE: 'ccls' packaging is maintained in the 'Git' version control system at:
https://salsa.debian.org/zhsj/ccls.git
Please use:
git clone https://salsa.debian.org/zhsj/ccls.git
to retrieve the latest (possibly unreleased) updates to the package.
Need to get 171 kB of source archives.
Get:1 http://172.17.4.1/private trixie-staging/main ccls 0.20230717-1 (dsc) [1323 B]
Get:2 http://172.17.4.1/private trixie-staging/main ccls 0.20230717-1 (tar) [162 kB]
Get:3 http://172.17.4.1/private trixie-staging/main ccls 0.20230717-1 (diff) [8172 B]
Fetched 171 kB in 0s (3673 kB/s)
Download complete and in download only mode
I: NOTICE: Log filtering will replace 'build/ccls-8lW75t/ccls-0.20230717' with '<<PKGBUILDDIR>>'
I: NOTICE: Log filtering will replace 'build/ccls-8lW75t' with '<<BUILDDIR>>'

+------------------------------------------------------------------------------+
| Install build-essential                                                      |
+------------------------------------------------------------------------------+


Setup apt archive
-----------------

Merged Build-Depends: build-essential, fakeroot
Filtered Build-Depends: build-essential, fakeroot
dpkg-deb: building package 'sbuild-build-depends-core-dummy' in '/<<BUILDDIR>>/resolver-2iKNAY/apt_archive/sbuild-build-depends-core-dummy.deb'.
dpkg-scanpackages: warning: Packages in archive but missing from override file:
dpkg-scanpackages: warning:   sbuild-build-depends-core-dummy
dpkg-scanpackages: info: Wrote 1 entries to output Packages file.
gpg: keybox '/<<BUILDDIR>>/resolver-2iKNAY/gpg/pubring.kbx' created
gpg: /<<BUILDDIR>>/resolver-2iKNAY/gpg/trustdb.gpg: trustdb created
gpg: key 37145E60F90AF620: public key "Sbuild Signer (Sbuild Build Dependency Archive Key) <buildd-tools-devel@lists.alioth.debian.org>" imported
gpg: Total number processed: 1
gpg:               imported: 1
gpg: key 37145E60F90AF620: "Sbuild Signer (Sbuild Build Dependency Archive Key) <buildd-tools-devel@lists.alioth.debian.org>" not changed
gpg: key 37145E60F90AF620: secret key imported
gpg: Total number processed: 1
gpg:              unchanged: 1
gpg:       secret keys read: 1
gpg:   secret keys imported: 1
gpg: using "Sbuild Signer" as default secret key for signing
Ign:1 copy:/<<BUILDDIR>>/resolver-2iKNAY/apt_archive ./ InRelease
Get:2 copy:/<<BUILDDIR>>/resolver-2iKNAY/apt_archive ./ Release [957 B]
Get:3 copy:/<<BUILDDIR>>/resolver-2iKNAY/apt_archive ./ Release.gpg [370 B]
Get:4 copy:/<<BUILDDIR>>/resolver-2iKNAY/apt_archive ./ Sources [349 B]
Get:5 copy:/<<BUILDDIR>>/resolver-2iKNAY/apt_archive ./ Packages [431 B]
Fetched 2107 B in 0s (10.4 kB/s)
Reading package lists...
W: No sandbox user '_apt' on the system, can not drop privileges
Reading package lists...

Install core build dependencies (apt-based resolver)
----------------------------------------------------

Installing build dependencies
Reading package lists...
Building dependency tree...
Reading state information...
The following packages were automatically installed and are no longer required:
  krb5-locales libpam-cap netbase sensible-utils sgml-base util-linux-extra
Use 'apt autoremove' to remove them.
The following NEW packages will be installed:
  sbuild-build-depends-core-dummy
0 upgraded, 1 newly installed, 0 to remove and 0 not upgraded.
Need to get 848 B of archives.
After this operation, 0 B of additional disk space will be used.
Get:1 copy:/<<BUILDDIR>>/resolver-2iKNAY/apt_archive ./ sbuild-build-depends-core-dummy 0.invalid.0 [848 B]
debconf: delaying package configuration, since apt-utils is not installed
Fetched 848 B in 0s (79.3 kB/s)
Selecting previously unselected package sbuild-build-depends-core-dummy.
(Reading database ... 12887 files and directories currently installed.)
Preparing to unpack .../sbuild-build-depends-core-dummy_0.invalid.0_armhf.deb ...
Unpacking sbuild-build-depends-core-dummy (0.invalid.0) ...
Setting up sbuild-build-depends-core-dummy (0.invalid.0) ...
W: No sandbox user '_apt' on the system, can not drop privileges

+------------------------------------------------------------------------------+
| Check architectures                                                          |
+------------------------------------------------------------------------------+

Arch check ok (armhf included in any)

+------------------------------------------------------------------------------+
| Install package build dependencies                                           |
+------------------------------------------------------------------------------+


Setup apt archive
-----------------

Merged Build-Depends: clang, cmake, debhelper-compat (= 13), libclang-dev, llvm-dev, python3, rapidjson-dev
Filtered Build-Depends: clang, cmake, debhelper-compat (= 13), libclang-dev, llvm-dev, python3, rapidjson-dev
dpkg-deb: building package 'sbuild-build-depends-ccls-dummy' in '/<<BUILDDIR>>/resolver-2iKNAY/apt_archive/sbuild-build-depends-ccls-dummy.deb'.
dpkg-scanpackages: warning: Packages in archive but missing from override file:
dpkg-scanpackages: warning:   sbuild-build-depends-ccls-dummy sbuild-build-depends-core-dummy
dpkg-scanpackages: info: Wrote 2 entries to output Packages file.
gpg: using "Sbuild Signer" as default secret key for signing
Ign:1 copy:/<<BUILDDIR>>/resolver-2iKNAY/apt_archive ./ InRelease
Get:2 copy:/<<BUILDDIR>>/resolver-2iKNAY/apt_archive ./ Release [963 B]
Get:3 copy:/<<BUILDDIR>>/resolver-2iKNAY/apt_archive ./ Release.gpg [370 B]
Get:4 copy:/<<BUILDDIR>>/resolver-2iKNAY/apt_archive ./ Sources [533 B]
Get:5 copy:/<<BUILDDIR>>/resolver-2iKNAY/apt_archive ./ Packages [607 B]
Fetched 2473 B in 0s (12.9 kB/s)
Reading package lists...
W: No sandbox user '_apt' on the system, can not drop privileges
Reading package lists...

Install ccls build dependencies (apt-based resolver)
----------------------------------------------------

Installing build dependencies
Reading package lists...
Building dependency tree...
Reading state information...
The following packages were automatically installed and are no longer required:
  krb5-locales libpam-cap sgml-base util-linux-extra
Use 'apt autoremove' to remove them.
The following additional packages will be installed:
  autoconf automake autopoint autotools-dev bsdextrautils clang clang-16 cmake
  cmake-data debhelper dh-autoreconf dh-strip-nondeterminism dwz file gettext
  gettext-base groff-base icu-devtools intltool-debian libarchive-zip-perl
  libarchive13 libbrotli1 libbsd0 libclang-16-dev libclang-common-16-dev
  libclang-cpp16 libclang-dev libclang1-16 libcurl4 libdebhelper-perl libedit2
  libelf1 libexpat1 libffi-dev libfile-stripnondeterminism-perl libgc1
  libicu-dev libicu72 libjsoncpp25 libllvm16 libmagic-mgc libmagic1
  libncurses-dev libncurses6 libnghttp2-14 libobjc-12-dev libobjc4 libpfm4
  libpipeline1 libproc2-0 libpsl5 libpython3-stdlib libpython3.11-minimal
  libpython3.11-stdlib librhash0 librtmp1 libssh2-1 libsub-override-perl
  libtool libuchardet0 libuv1 libxml2 libxml2-dev libyaml-0-2 libz3-4
  libz3-dev llvm llvm-16 llvm-16-dev llvm-16-linker-tools llvm-16-runtime
  llvm-16-tools llvm-dev llvm-runtime m4 man-db media-types po-debconf procps
  python3 python3-minimal python3-pkg-resources python3-pygments python3-yaml
  python3.11 python3.11-minimal rapidjson-dev
Suggested packages:
  autoconf-archive gnu-standards autoconf-doc clang-16-doc wasi-libc cmake-doc
  cmake-format elpa-cmake-mode ninja-build dh-make gettext-doc libasprintf-dev
  libgettextpo-dev groff lrzip icu-doc ncurses-doc libtool-doc gfortran
  | fortran95-compiler gcj-jdk pkg-config llvm-16-doc m4-doc apparmor less
  www-browser libmail-box-perl python3-doc python3-tk python3-venv
  python3-setuptools python-pygments-doc ttf-bitstream-vera python3.11-venv
  python3.11-doc binfmt-support rapidjson-doc
Recommended packages:
  curl | wget | lynx libclang-rt-16-dev ca-certificates libarchive-cpio-perl
  libgpm2 publicsuffix libltdl-dev binfmt-support | systemd
  libmail-sendmail-perl psmisc
The following NEW packages will be installed:
  autoconf automake autopoint autotools-dev bsdextrautils clang clang-16 cmake
  cmake-data debhelper dh-autoreconf dh-strip-nondeterminism dwz file gettext
  gettext-base groff-base icu-devtools intltool-debian libarchive-zip-perl
  libarchive13 libbrotli1 libbsd0 libclang-16-dev libclang-common-16-dev
  libclang-cpp16 libclang-dev libclang1-16 libcurl4 libdebhelper-perl libedit2
  libelf1 libexpat1 libffi-dev libfile-stripnondeterminism-perl libgc1
  libicu-dev libicu72 libjsoncpp25 libllvm16 libmagic-mgc libmagic1
  libncurses-dev libncurses6 libnghttp2-14 libobjc-12-dev libobjc4 libpfm4
  libpipeline1 libproc2-0 libpsl5 libpython3-stdlib libpython3.11-minimal
  libpython3.11-stdlib librhash0 librtmp1 libssh2-1 libsub-override-perl
  libtool libuchardet0 libuv1 libxml2 libxml2-dev libyaml-0-2 libz3-4
  libz3-dev llvm llvm-16 llvm-16-dev llvm-16-linker-tools llvm-16-runtime
  llvm-16-tools llvm-dev llvm-runtime m4 man-db media-types po-debconf procps
  python3 python3-minimal python3-pkg-resources python3-pygments python3-yaml
  python3.11 python3.11-minimal rapidjson-dev sbuild-build-depends-ccls-dummy
0 upgraded, 88 newly installed, 0 to remove and 0 not upgraded.
Need to get 177 MB of archives.
After this operation, 1071 MB of additional disk space will be used.
Get:1 copy:/<<BUILDDIR>>/resolver-2iKNAY/apt_archive ./ sbuild-build-depends-ccls-dummy 0.invalid.0 [892 B]
Get:2 http://172.17.4.1/private trixie-staging/main armhf libpython3.11-minimal armhf 3.11.8-1 [801 kB]
Get:3 http://172.17.4.1/private trixie-staging/main armhf libexpat1 armhf 2.5.0-2 [76.8 kB]
Get:4 http://172.17.4.1/private trixie-staging/main armhf python3.11-minimal armhf 3.11.8-1 [1676 kB]
Get:5 http://172.17.4.1/private trixie-staging/main armhf python3-minimal armhf 3.11.6-1 [26.2 kB]
Get:6 http://172.17.4.1/private trixie-staging/main armhf media-types all 10.1.0 [26.9 kB]
Get:7 http://172.17.4.1/private trixie-staging/main armhf libpython3.11-stdlib armhf 3.11.8-1 [1697 kB]
Get:8 http://172.17.4.1/private trixie-staging/main armhf python3.11 armhf 3.11.8-1 [597 kB]
Get:9 http://172.17.4.1/private trixie-staging/main armhf libpython3-stdlib armhf 3.11.6-1 [9224 B]
Get:10 http://172.17.4.1/private trixie-staging/main armhf python3 armhf 3.11.6-1 [26.2 kB]
Get:11 http://172.17.4.1/private trixie-staging/main armhf libuchardet0 armhf 0.0.8-1 [65.5 kB]
Get:12 http://172.17.4.1/private trixie-staging/main armhf groff-base armhf 1.23.0-3 [1033 kB]
Get:13 http://172.17.4.1/private trixie-staging/main armhf bsdextrautils armhf 2.39.3-6 [81.4 kB]
Get:14 http://172.17.4.1/private trixie-staging/main armhf libpipeline1 armhf 1.5.7-1 [33.4 kB]
Get:15 http://172.17.4.1/private trixie-staging/main armhf man-db armhf 2.12.0-3 [1358 kB]
Get:16 http://172.17.4.1/private trixie-staging/main armhf libproc2-0 armhf 2:4.0.4-4 [54.8 kB]
Get:17 http://172.17.4.1/private trixie-staging/main armhf procps armhf 2:4.0.4-4 [848 kB]
Get:18 http://172.17.4.1/private trixie-staging/main armhf libmagic-mgc armhf 1:5.45-2 [314 kB]
Get:19 http://172.17.4.1/private trixie-staging/main armhf libmagic1 armhf 1:5.45-2 [96.1 kB]
Get:20 http://172.17.4.1/private trixie-staging/main armhf file armhf 1:5.45-2 [41.6 kB]
Get:21 http://172.17.4.1/private trixie-staging/main armhf gettext-base armhf 0.21-14 [157 kB]
Get:22 http://172.17.4.1/private trixie-staging/main armhf m4 armhf 1.4.19-4 [256 kB]
Get:23 http://172.17.4.1/private trixie-staging/main armhf autoconf all 2.71-3 [332 kB]
Get:24 http://172.17.4.1/private trixie-staging/main armhf autotools-dev all 20220109.1 [51.6 kB]
Get:25 http://172.17.4.1/private trixie-staging/main armhf automake all 1:1.16.5-1.3 [823 kB]
Get:26 http://172.17.4.1/private trixie-staging/main armhf autopoint all 0.21-14 [496 kB]
Get:27 http://172.17.4.1/private trixie-staging/main armhf libbsd0 armhf 0.11.8-1 [120 kB]
Get:28 http://172.17.4.1/private trixie-staging/main armhf libedit2 armhf 3.1-20230828-1 [76.0 kB]
Get:29 http://172.17.4.1/private trixie-staging/main armhf libicu72 armhf 72.1-4 [9009 kB]
Get:30 http://172.17.4.1/private trixie-staging/main armhf libxml2 armhf 2.9.14+dfsg-1.3 [571 kB]
Get:31 http://172.17.4.1/private trixie-staging/main armhf libz3-4 armhf 4.8.12-3.1 [5797 kB]
Get:32 http://172.17.4.1/private trixie-staging/main armhf libllvm16 armhf 1:16.0.6-15+rpi1 [20.7 MB]
Get:33 http://172.17.4.1/private trixie-staging/main armhf libclang-cpp16 armhf 1:16.0.6-15+rpi1 [9929 kB]
Get:34 http://172.17.4.1/private trixie-staging/main armhf libgc1 armhf 1:8.2.6-1 [234 kB]
Get:35 http://172.17.4.1/private trixie-staging/main armhf libobjc4 armhf 13.2.0-9+rpi1 [33.8 kB]
Get:36 http://172.17.4.1/private trixie-staging/main armhf libobjc-12-dev armhf 12.3.0-14+rpi1 [159 kB]
Get:37 http://172.17.4.1/private trixie-staging/main armhf libclang-common-16-dev all 1:16.0.6-15+rpi1 [656 kB]
Get:38 http://172.17.4.1/private trixie-staging/main armhf llvm-16-linker-tools armhf 1:16.0.6-15+rpi1 [1021 kB]
Get:39 http://172.17.4.1/private trixie-staging/main armhf libclang1-16 armhf 1:16.0.6-15+rpi1 [5584 kB]
Get:40 http://172.17.4.1/private trixie-staging/main armhf clang-16 armhf 1:16.0.6-15+rpi1 [104 kB]
Get:41 http://172.17.4.1/private trixie-staging/main armhf clang armhf 1:16.0-57 [5360 B]
Get:42 http://172.17.4.1/private trixie-staging/main armhf libarchive13 armhf 3.7.2-1 [294 kB]
Get:43 http://172.17.4.1/private trixie-staging/main armhf libbrotli1 armhf 1.1.0-2 [280 kB]
Get:44 http://172.17.4.1/private trixie-staging/main armhf libnghttp2-14 armhf 1.59.0-1 [61.9 kB]
Get:45 http://172.17.4.1/private trixie-staging/main armhf libpsl5 armhf 0.21.2-1+b1 [57.8 kB]
Get:46 http://172.17.4.1/private trixie-staging/main armhf librtmp1 armhf 2.4+20151223.gitfa8646d.1-2+b2 [54.2 kB]
Get:47 http://172.17.4.1/private trixie-staging/main armhf libssh2-1 armhf 1.11.0-4 [195 kB]
Get:48 http://172.17.4.1/private trixie-staging/main armhf libcurl4 armhf 8.5.0-2+rpi1 [377 kB]
Get:49 http://172.17.4.1/private trixie-staging/main armhf libjsoncpp25 armhf 1.9.5-6 [64.7 kB]
Get:50 http://172.17.4.1/private trixie-staging/main armhf librhash0 armhf 1.4.3-3 [142 kB]
Get:51 http://172.17.4.1/private trixie-staging/main armhf libuv1 armhf 1.46.0-3+rpi1 [129 kB]
Get:52 http://172.17.4.1/private trixie-staging/main armhf cmake-data all 3.28.3-1 [2128 kB]
Get:53 http://172.17.4.1/private trixie-staging/main armhf cmake armhf 3.28.3-1 [7765 kB]
Get:54 http://172.17.4.1/private trixie-staging/main armhf libdebhelper-perl all 13.13 [85.0 kB]
Get:55 http://172.17.4.1/private trixie-staging/main armhf libtool all 2.4.7-7 [517 kB]
Get:56 http://172.17.4.1/private trixie-staging/main armhf dh-autoreconf all 20 [17.1 kB]
Get:57 http://172.17.4.1/private trixie-staging/main armhf libarchive-zip-perl all 1.68-1 [104 kB]
Get:58 http://172.17.4.1/private trixie-staging/main armhf libsub-override-perl all 0.10-1 [10.6 kB]
Get:59 http://172.17.4.1/private trixie-staging/main armhf libfile-stripnondeterminism-perl all 1.13.1-1 [19.4 kB]
Get:60 http://172.17.4.1/private trixie-staging/main armhf dh-strip-nondeterminism all 1.13.1-1 [8620 B]
Get:61 http://172.17.4.1/private trixie-staging/main armhf libelf1 armhf 0.188-2.1+rpi1 [171 kB]
Get:62 http://172.17.4.1/private trixie-staging/main armhf dwz armhf 0.15-1 [92.4 kB]
Get:63 http://172.17.4.1/private trixie-staging/main armhf gettext armhf 0.21-14 [1203 kB]
Get:64 http://172.17.4.1/private trixie-staging/main armhf intltool-debian all 0.35.0+20060710.6 [22.9 kB]
Get:65 http://172.17.4.1/private trixie-staging/main armhf po-debconf all 1.0.21+nmu1 [248 kB]
Get:66 http://172.17.4.1/private trixie-staging/main armhf debhelper all 13.13 [889 kB]
Get:67 http://172.17.4.1/private trixie-staging/main armhf icu-devtools armhf 72.1-4 [174 kB]
Get:68 http://172.17.4.1/private trixie-staging/main armhf libclang-16-dev armhf 1:16.0.6-15+rpi1 [26.2 MB]
Get:69 http://172.17.4.1/private trixie-staging/main armhf libclang-dev armhf 1:16.0-57 [4948 B]
Get:70 http://172.17.4.1/private trixie-staging/main armhf libffi-dev armhf 3.4.4-2 [61.1 kB]
Get:71 http://172.17.4.1/private trixie-staging/main armhf libicu-dev armhf 72.1-4 [9956 kB]
Get:72 http://172.17.4.1/private trixie-staging/main armhf libncurses6 armhf 6.4+20240113-1 [80.9 kB]
Get:73 http://172.17.4.1/private trixie-staging/main armhf libncurses-dev armhf 6.4+20240113-1 [289 kB]
Get:74 http://172.17.4.1/private trixie-staging/main armhf libpfm4 armhf 4.13.0+git16-g535c204-1 [45.9 kB]
Get:75 http://172.17.4.1/private trixie-staging/main armhf libxml2-dev armhf 2.9.14+dfsg-1.3 [636 kB]
Get:76 http://172.17.4.1/private trixie-staging/main armhf libyaml-0-2 armhf 0.2.5-1 [44.6 kB]
Get:77 http://172.17.4.1/private trixie-staging/main armhf libz3-dev armhf 4.8.12-3.1 [90.6 kB]
Get:78 http://172.17.4.1/private trixie-staging/main armhf llvm-16-runtime armhf 1:16.0.6-15+rpi1 [459 kB]
Get:79 http://172.17.4.1/private trixie-staging/main armhf llvm-runtime armhf 1:16.0-57 [5032 B]
Get:80 http://172.17.4.1/private trixie-staging/main armhf llvm-16 armhf 1:16.0.6-15+rpi1 [19.0 MB]
Get:81 http://172.17.4.1/private trixie-staging/main armhf llvm armhf 1:16.0-57 [7420 B]
Get:82 http://172.17.4.1/private trixie-staging/main armhf python3-pkg-resources all 68.1.2-2 [241 kB]
Get:83 http://172.17.4.1/private trixie-staging/main armhf python3-pygments all 2.17.2+dfsg-1 [818 kB]
Get:84 http://172.17.4.1/private trixie-staging/main armhf python3-yaml armhf 6.0.1-2 [109 kB]
Get:85 http://172.17.4.1/private trixie-staging/main armhf llvm-16-tools armhf 1:16.0.6-15+rpi1 [424 kB]
Get:86 http://172.17.4.1/private trixie-staging/main armhf llvm-16-dev armhf 1:16.0.6-15+rpi1 [38.4 MB]
Get:87 http://172.17.4.1/private trixie-staging/main armhf llvm-dev armhf 1:16.0-57 [5284 B]
Get:88 http://172.17.4.1/private trixie-staging/main armhf rapidjson-dev all 1.1.0+dfsg2-7.1 [97.7 kB]
debconf: delaying package configuration, since apt-utils is not installed
Fetched 177 MB in 20s (8946 kB/s)
Selecting previously unselected package libpython3.11-minimal:armhf.
(Reading database ... 12887 files and directories currently installed.)
Preparing to unpack .../libpython3.11-minimal_3.11.8-1_armhf.deb ...
Unpacking libpython3.11-minimal:armhf (3.11.8-1) ...
Selecting previously unselected package libexpat1:armhf.
Preparing to unpack .../libexpat1_2.5.0-2_armhf.deb ...
Unpacking libexpat1:armhf (2.5.0-2) ...
Selecting previously unselected package python3.11-minimal.
Preparing to unpack .../python3.11-minimal_3.11.8-1_armhf.deb ...
Unpacking python3.11-minimal (3.11.8-1) ...
Setting up libpython3.11-minimal:armhf (3.11.8-1) ...
Setting up libexpat1:armhf (2.5.0-2) ...
Setting up python3.11-minimal (3.11.8-1) ...
Selecting previously unselected package python3-minimal.
(Reading database ... 13203 files and directories currently installed.)
Preparing to unpack .../python3-minimal_3.11.6-1_armhf.deb ...
Unpacking python3-minimal (3.11.6-1) ...
Selecting previously unselected package media-types.
Preparing to unpack .../media-types_10.1.0_all.deb ...
Unpacking media-types (10.1.0) ...
Selecting previously unselected package libpython3.11-stdlib:armhf.
Preparing to unpack .../libpython3.11-stdlib_3.11.8-1_armhf.deb ...
Unpacking libpython3.11-stdlib:armhf (3.11.8-1) ...
Selecting previously unselected package python3.11.
Preparing to unpack .../python3.11_3.11.8-1_armhf.deb ...
Unpacking python3.11 (3.11.8-1) ...
Selecting previously unselected package libpython3-stdlib:armhf.
Preparing to unpack .../libpython3-stdlib_3.11.6-1_armhf.deb ...
Unpacking libpython3-stdlib:armhf (3.11.6-1) ...
Setting up python3-minimal (3.11.6-1) ...
Selecting previously unselected package python3.
(Reading database ... 13630 files and directories currently installed.)
Preparing to unpack .../00-python3_3.11.6-1_armhf.deb ...
Unpacking python3 (3.11.6-1) ...
Selecting previously unselected package libuchardet0:armhf.
Preparing to unpack .../01-libuchardet0_0.0.8-1_armhf.deb ...
Unpacking libuchardet0:armhf (0.0.8-1) ...
Selecting previously unselected package groff-base.
Preparing to unpack .../02-groff-base_1.23.0-3_armhf.deb ...
Unpacking groff-base (1.23.0-3) ...
Selecting previously unselected package bsdextrautils.
Preparing to unpack .../03-bsdextrautils_2.39.3-6_armhf.deb ...
Unpacking bsdextrautils (2.39.3-6) ...
Selecting previously unselected package libpipeline1:armhf.
Preparing to unpack .../04-libpipeline1_1.5.7-1_armhf.deb ...
Unpacking libpipeline1:armhf (1.5.7-1) ...
Selecting previously unselected package man-db.
Preparing to unpack .../05-man-db_2.12.0-3_armhf.deb ...
Unpacking man-db (2.12.0-3) ...
Selecting previously unselected package libproc2-0:armhf.
Preparing to unpack .../06-libproc2-0_2%3a4.0.4-4_armhf.deb ...
Unpacking libproc2-0:armhf (2:4.0.4-4) ...
Selecting previously unselected package procps.
Preparing to unpack .../07-procps_2%3a4.0.4-4_armhf.deb ...
Unpacking procps (2:4.0.4-4) ...
Selecting previously unselected package libmagic-mgc.
Preparing to unpack .../08-libmagic-mgc_1%3a5.45-2_armhf.deb ...
Unpacking libmagic-mgc (1:5.45-2) ...
Selecting previously unselected package libmagic1:armhf.
Preparing to unpack .../09-libmagic1_1%3a5.45-2_armhf.deb ...
Unpacking libmagic1:armhf (1:5.45-2) ...
Selecting previously unselected package file.
Preparing to unpack .../10-file_1%3a5.45-2_armhf.deb ...
Unpacking file (1:5.45-2) ...
Selecting previously unselected package gettext-base.
Preparing to unpack .../11-gettext-base_0.21-14_armhf.deb ...
Unpacking gettext-base (0.21-14) ...
Selecting previously unselected package m4.
Preparing to unpack .../12-m4_1.4.19-4_armhf.deb ...
Unpacking m4 (1.4.19-4) ...
Selecting previously unselected package autoconf.
Preparing to unpack .../13-autoconf_2.71-3_all.deb ...
Unpacking autoconf (2.71-3) ...
Selecting previously unselected package autotools-dev.
Preparing to unpack .../14-autotools-dev_20220109.1_all.deb ...
Unpacking autotools-dev (20220109.1) ...
Selecting previously unselected package automake.
Preparing to unpack .../15-automake_1%3a1.16.5-1.3_all.deb ...
Unpacking automake (1:1.16.5-1.3) ...
Selecting previously unselected package autopoint.
Preparing to unpack .../16-autopoint_0.21-14_all.deb ...
Unpacking autopoint (0.21-14) ...
Selecting previously unselected package libbsd0:armhf.
Preparing to unpack .../17-libbsd0_0.11.8-1_armhf.deb ...
Unpacking libbsd0:armhf (0.11.8-1) ...
Selecting previously unselected package libedit2:armhf.
Preparing to unpack .../18-libedit2_3.1-20230828-1_armhf.deb ...
Unpacking libedit2:armhf (3.1-20230828-1) ...
Selecting previously unselected package libicu72:armhf.
Preparing to unpack .../19-libicu72_72.1-4_armhf.deb ...
Unpacking libicu72:armhf (72.1-4) ...
Selecting previously unselected package libxml2:armhf.
Preparing to unpack .../20-libxml2_2.9.14+dfsg-1.3_armhf.deb ...
Unpacking libxml2:armhf (2.9.14+dfsg-1.3) ...
Selecting previously unselected package libz3-4:armhf.
Preparing to unpack .../21-libz3-4_4.8.12-3.1_armhf.deb ...
Unpacking libz3-4:armhf (4.8.12-3.1) ...
Selecting previously unselected package libllvm16:armhf.
Preparing to unpack .../22-libllvm16_1%3a16.0.6-15+rpi1_armhf.deb ...
Unpacking libllvm16:armhf (1:16.0.6-15+rpi1) ...
Selecting previously unselected package libclang-cpp16.
Preparing to unpack .../23-libclang-cpp16_1%3a16.0.6-15+rpi1_armhf.deb ...
Unpacking libclang-cpp16 (1:16.0.6-15+rpi1) ...
Selecting previously unselected package libgc1:armhf.
Preparing to unpack .../24-libgc1_1%3a8.2.6-1_armhf.deb ...
Unpacking libgc1:armhf (1:8.2.6-1) ...
Selecting previously unselected package libobjc4:armhf.
Preparing to unpack .../25-libobjc4_13.2.0-9+rpi1_armhf.deb ...
Unpacking libobjc4:armhf (13.2.0-9+rpi1) ...
Selecting previously unselected package libobjc-12-dev:armhf.
Preparing to unpack .../26-libobjc-12-dev_12.3.0-14+rpi1_armhf.deb ...
Unpacking libobjc-12-dev:armhf (12.3.0-14+rpi1) ...
Selecting previously unselected package libclang-common-16-dev.
Preparing to unpack .../27-libclang-common-16-dev_1%3a16.0.6-15+rpi1_all.deb ...
Unpacking libclang-common-16-dev (1:16.0.6-15+rpi1) ...
Selecting previously unselected package llvm-16-linker-tools.
Preparing to unpack .../28-llvm-16-linker-tools_1%3a16.0.6-15+rpi1_armhf.deb ...
Unpacking llvm-16-linker-tools (1:16.0.6-15+rpi1) ...
Selecting previously unselected package libclang1-16.
Preparing to unpack .../29-libclang1-16_1%3a16.0.6-15+rpi1_armhf.deb ...
Unpacking libclang1-16 (1:16.0.6-15+rpi1) ...
Selecting previously unselected package clang-16.
Preparing to unpack .../30-clang-16_1%3a16.0.6-15+rpi1_armhf.deb ...
Unpacking clang-16 (1:16.0.6-15+rpi1) ...
Selecting previously unselected package clang.
Preparing to unpack .../31-clang_1%3a16.0-57_armhf.deb ...
Unpacking clang (1:16.0-57) ...
Selecting previously unselected package libarchive13:armhf.
Preparing to unpack .../32-libarchive13_3.7.2-1_armhf.deb ...
Unpacking libarchive13:armhf (3.7.2-1) ...
Selecting previously unselected package libbrotli1:armhf.
Preparing to unpack .../33-libbrotli1_1.1.0-2_armhf.deb ...
Unpacking libbrotli1:armhf (1.1.0-2) ...
Selecting previously unselected package libnghttp2-14:armhf.
Preparing to unpack .../34-libnghttp2-14_1.59.0-1_armhf.deb ...
Unpacking libnghttp2-14:armhf (1.59.0-1) ...
Selecting previously unselected package libpsl5:armhf.
Preparing to unpack .../35-libpsl5_0.21.2-1+b1_armhf.deb ...
Unpacking libpsl5:armhf (0.21.2-1+b1) ...
Selecting previously unselected package librtmp1:armhf.
Preparing to unpack .../36-librtmp1_2.4+20151223.gitfa8646d.1-2+b2_armhf.deb ...
Unpacking librtmp1:armhf (2.4+20151223.gitfa8646d.1-2+b2) ...
Selecting previously unselected package libssh2-1:armhf.
Preparing to unpack .../37-libssh2-1_1.11.0-4_armhf.deb ...
Unpacking libssh2-1:armhf (1.11.0-4) ...
Selecting previously unselected package libcurl4:armhf.
Preparing to unpack .../38-libcurl4_8.5.0-2+rpi1_armhf.deb ...
Unpacking libcurl4:armhf (8.5.0-2+rpi1) ...
Selecting previously unselected package libjsoncpp25:armhf.
Preparing to unpack .../39-libjsoncpp25_1.9.5-6_armhf.deb ...
Unpacking libjsoncpp25:armhf (1.9.5-6) ...
Selecting previously unselected package librhash0:armhf.
Preparing to unpack .../40-librhash0_1.4.3-3_armhf.deb ...
Unpacking librhash0:armhf (1.4.3-3) ...
Selecting previously unselected package libuv1:armhf.
Preparing to unpack .../41-libuv1_1.46.0-3+rpi1_armhf.deb ...
Unpacking libuv1:armhf (1.46.0-3+rpi1) ...
Selecting previously unselected package cmake-data.
Preparing to unpack .../42-cmake-data_3.28.3-1_all.deb ...
Unpacking cmake-data (3.28.3-1) ...
Selecting previously unselected package cmake.
Preparing to unpack .../43-cmake_3.28.3-1_armhf.deb ...
Unpacking cmake (3.28.3-1) ...
Selecting previously unselected package libdebhelper-perl.
Preparing to unpack .../44-libdebhelper-perl_13.13_all.deb ...
Unpacking libdebhelper-perl (13.13) ...
Selecting previously unselected package libtool.
Preparing to unpack .../45-libtool_2.4.7-7_all.deb ...
Unpacking libtool (2.4.7-7) ...
Selecting previously unselected package dh-autoreconf.
Preparing to unpack .../46-dh-autoreconf_20_all.deb ...
Unpacking dh-autoreconf (20) ...
Selecting previously unselected package libarchive-zip-perl.
Preparing to unpack .../47-libarchive-zip-perl_1.68-1_all.deb ...
Unpacking libarchive-zip-perl (1.68-1) ...
Selecting previously unselected package libsub-override-perl.
Preparing to unpack .../48-libsub-override-perl_0.10-1_all.deb ...
Unpacking libsub-override-perl (0.10-1) ...
Selecting previously unselected package libfile-stripnondeterminism-perl.
Preparing to unpack .../49-libfile-stripnondeterminism-perl_1.13.1-1_all.deb ...
Unpacking libfile-stripnondeterminism-perl (1.13.1-1) ...
Selecting previously unselected package dh-strip-nondeterminism.
Preparing to unpack .../50-dh-strip-nondeterminism_1.13.1-1_all.deb ...
Unpacking dh-strip-nondeterminism (1.13.1-1) ...
Selecting previously unselected package libelf1:armhf.
Preparing to unpack .../51-libelf1_0.188-2.1+rpi1_armhf.deb ...
Unpacking libelf1:armhf (0.188-2.1+rpi1) ...
Selecting previously unselected package dwz.
Preparing to unpack .../52-dwz_0.15-1_armhf.deb ...
Unpacking dwz (0.15-1) ...
Selecting previously unselected package gettext.
Preparing to unpack .../53-gettext_0.21-14_armhf.deb ...
Unpacking gettext (0.21-14) ...
Selecting previously unselected package intltool-debian.
Preparing to unpack .../54-intltool-debian_0.35.0+20060710.6_all.deb ...
Unpacking intltool-debian (0.35.0+20060710.6) ...
Selecting previously unselected package po-debconf.
Preparing to unpack .../55-po-debconf_1.0.21+nmu1_all.deb ...
Unpacking po-debconf (1.0.21+nmu1) ...
Selecting previously unselected package debhelper.
Preparing to unpack .../56-debhelper_13.13_all.deb ...
Unpacking debhelper (13.13) ...
Selecting previously unselected package icu-devtools.
Preparing to unpack .../57-icu-devtools_72.1-4_armhf.deb ...
Unpacking icu-devtools (72.1-4) ...
Selecting previously unselected package libclang-16-dev.
Preparing to unpack .../58-libclang-16-dev_1%3a16.0.6-15+rpi1_armhf.deb ...
Unpacking libclang-16-dev (1:16.0.6-15+rpi1) ...
Selecting previously unselected package libclang-dev.
Preparing to unpack .../59-libclang-dev_1%3a16.0-57_armhf.deb ...
Unpacking libclang-dev (1:16.0-57) ...
Selecting previously unselected package libffi-dev:armhf.
Preparing to unpack .../60-libffi-dev_3.4.4-2_armhf.deb ...
Unpacking libffi-dev:armhf (3.4.4-2) ...
Selecting previously unselected package libicu-dev:armhf.
Preparing to unpack .../61-libicu-dev_72.1-4_armhf.deb ...
Unpacking libicu-dev:armhf (72.1-4) ...
Selecting previously unselected package libncurses6:armhf.
Preparing to unpack .../62-libncurses6_6.4+20240113-1_armhf.deb ...
Unpacking libncurses6:armhf (6.4+20240113-1) ...
Selecting previously unselected package libncurses-dev:armhf.
Preparing to unpack .../63-libncurses-dev_6.4+20240113-1_armhf.deb ...
Unpacking libncurses-dev:armhf (6.4+20240113-1) ...
Selecting previously unselected package libpfm4:armhf.
Preparing to unpack .../64-libpfm4_4.13.0+git16-g535c204-1_armhf.deb ...
Unpacking libpfm4:armhf (4.13.0+git16-g535c204-1) ...
Selecting previously unselected package libxml2-dev:armhf.
Preparing to unpack .../65-libxml2-dev_2.9.14+dfsg-1.3_armhf.deb ...
Unpacking libxml2-dev:armhf (2.9.14+dfsg-1.3) ...
Selecting previously unselected package libyaml-0-2:armhf.
Preparing to unpack .../66-libyaml-0-2_0.2.5-1_armhf.deb ...
Unpacking libyaml-0-2:armhf (0.2.5-1) ...
Selecting previously unselected package libz3-dev:armhf.
Preparing to unpack .../67-libz3-dev_4.8.12-3.1_armhf.deb ...
Unpacking libz3-dev:armhf (4.8.12-3.1) ...
Selecting previously unselected package llvm-16-runtime.
Preparing to unpack .../68-llvm-16-runtime_1%3a16.0.6-15+rpi1_armhf.deb ...
Unpacking llvm-16-runtime (1:16.0.6-15+rpi1) ...
Selecting previously unselected package llvm-runtime:armhf.
Preparing to unpack .../69-llvm-runtime_1%3a16.0-57_armhf.deb ...
Unpacking llvm-runtime:armhf (1:16.0-57) ...
Selecting previously unselected package llvm-16.
Preparing to unpack .../70-llvm-16_1%3a16.0.6-15+rpi1_armhf.deb ...
Unpacking llvm-16 (1:16.0.6-15+rpi1) ...
Selecting previously unselected package llvm.
Preparing to unpack .../71-llvm_1%3a16.0-57_armhf.deb ...
Unpacking llvm (1:16.0-57) ...
Selecting previously unselected package python3-pkg-resources.
Preparing to unpack .../72-python3-pkg-resources_68.1.2-2_all.deb ...
Unpacking python3-pkg-resources (68.1.2-2) ...
Selecting previously unselected package python3-pygments.
Preparing to unpack .../73-python3-pygments_2.17.2+dfsg-1_all.deb ...
Unpacking python3-pygments (2.17.2+dfsg-1) ...
Selecting previously unselected package python3-yaml.
Preparing to unpack .../74-python3-yaml_6.0.1-2_armhf.deb ...
Unpacking python3-yaml (6.0.1-2) ...
Selecting previously unselected package llvm-16-tools.
Preparing to unpack .../75-llvm-16-tools_1%3a16.0.6-15+rpi1_armhf.deb ...
Unpacking llvm-16-tools (1:16.0.6-15+rpi1) ...
Selecting previously unselected package llvm-16-dev.
Preparing to unpack .../76-llvm-16-dev_1%3a16.0.6-15+rpi1_armhf.deb ...
Unpacking llvm-16-dev (1:16.0.6-15+rpi1) ...
Selecting previously unselected package llvm-dev.
Preparing to unpack .../77-llvm-dev_1%3a16.0-57_armhf.deb ...
Unpacking llvm-dev (1:16.0-57) ...
Selecting previously unselected package rapidjson-dev.
Preparing to unpack .../78-rapidjson-dev_1.1.0+dfsg2-7.1_all.deb ...
Unpacking rapidjson-dev (1.1.0+dfsg2-7.1) ...
Selecting previously unselected package sbuild-build-depends-ccls-dummy.
Preparing to unpack .../79-sbuild-build-depends-ccls-dummy_0.invalid.0_armhf.deb ...
Unpacking sbuild-build-depends-ccls-dummy (0.invalid.0) ...
Setting up media-types (10.1.0) ...
Setting up libpipeline1:armhf (1.5.7-1) ...
Setting up libpsl5:armhf (0.21.2-1+b1) ...
Setting up libicu72:armhf (72.1-4) ...
Setting up bsdextrautils (2.39.3-6) ...
Setting up libmagic-mgc (1:5.45-2) ...
Setting up libarchive-zip-perl (1.68-1) ...
Setting up libyaml-0-2:armhf (0.2.5-1) ...
Setting up libpython3.11-stdlib:armhf (3.11.8-1) ...
Setting up libdebhelper-perl (13.13) ...
Setting up libbrotli1:armhf (1.1.0-2) ...
Setting up libnghttp2-14:armhf (1.59.0-1) ...
Setting up libmagic1:armhf (1:5.45-2) ...
Setting up gettext-base (0.21-14) ...
Setting up m4 (1.4.19-4) ...
Setting up file (1:5.45-2) ...
Setting up libffi-dev:armhf (3.4.4-2) ...
Setting up rapidjson-dev (1.1.0+dfsg2-7.1) ...
Setting up autotools-dev (20220109.1) ...
Setting up libz3-4:armhf (4.8.12-3.1) ...
Setting up libuv1:armhf (1.46.0-3+rpi1) ...
Setting up libpfm4:armhf (4.13.0+git16-g535c204-1) ...
Setting up librtmp1:armhf (2.4+20151223.gitfa8646d.1-2+b2) ...
Setting up libncurses6:armhf (6.4+20240113-1) ...
Setting up libproc2-0:armhf (2:4.0.4-4) ...
Setting up autopoint (0.21-14) ...
Setting up libjsoncpp25:armhf (1.9.5-6) ...
Setting up icu-devtools (72.1-4) ...
Setting up libgc1:armhf (1:8.2.6-1) ...
Setting up autoconf (2.71-3) ...
Setting up librhash0:armhf (1.4.3-3) ...
Setting up libuchardet0:armhf (0.0.8-1) ...
Setting up procps (2:4.0.4-4) ...
Setting up libsub-override-perl (0.10-1) ...
Setting up libssh2-1:armhf (1.11.0-4) ...
Setting up cmake-data (3.28.3-1) ...
Setting up libbsd0:armhf (0.11.8-1) ...
Setting up libelf1:armhf (0.188-2.1+rpi1) ...
Setting up libicu-dev:armhf (72.1-4) ...
Setting up libxml2:armhf (2.9.14+dfsg-1.3) ...
Setting up libpython3-stdlib:armhf (3.11.6-1) ...
Setting up automake (1:1.16.5-1.3) ...
update-alternatives: using /usr/bin/automake-1.16 to provide /usr/bin/automake (automake) in auto mode
Setting up libfile-stripnondeterminism-perl (1.13.1-1) ...
Setting up libz3-dev:armhf (4.8.12-3.1) ...
Setting up python3.11 (3.11.8-1) ...
Setting up libncurses-dev:armhf (6.4+20240113-1) ...
Setting up gettext (0.21-14) ...
Setting up libtool (2.4.7-7) ...
Setting up libarchive13:armhf (3.7.2-1) ...
Setting up libedit2:armhf (3.1-20230828-1) ...
Setting up libobjc4:armhf (13.2.0-9+rpi1) ...
Setting up python3 (3.11.6-1) ...
Setting up intltool-debian (0.35.0+20060710.6) ...
Setting up dh-autoreconf (20) ...
Setting up libxml2-dev:armhf (2.9.14+dfsg-1.3) ...
Setting up dh-strip-nondeterminism (1.13.1-1) ...
Setting up libobjc-12-dev:armhf (12.3.0-14+rpi1) ...
Setting up dwz (0.15-1) ...
Setting up groff-base (1.23.0-3) ...
Setting up libcurl4:armhf (8.5.0-2+rpi1) ...
Setting up libllvm16:armhf (1:16.0.6-15+rpi1) ...
Setting up python3-pkg-resources (68.1.2-2) ...
Setting up libclang1-16 (1:16.0.6-15+rpi1) ...
Setting up po-debconf (1.0.21+nmu1) ...
Setting up llvm-16-runtime (1:16.0.6-15+rpi1) ...
Setting up python3-yaml (6.0.1-2) ...
Setting up libclang-common-16-dev (1:16.0.6-15+rpi1) ...
Setting up man-db (2.12.0-3) ...
Not building database; man-db/auto-update is not 'true'.
Setting up llvm-16-linker-tools (1:16.0.6-15+rpi1) ...
Setting up python3-pygments (2.17.2+dfsg-1) ...
Setting up llvm-runtime:armhf (1:16.0-57) ...
Setting up libclang-cpp16 (1:16.0.6-15+rpi1) ...
Setting up cmake (3.28.3-1) ...
Setting up llvm-16 (1:16.0.6-15+rpi1) ...
Setting up libclang-16-dev (1:16.0.6-15+rpi1) ...
Setting up libclang-dev (1:16.0-57) ...
Setting up clang-16 (1:16.0.6-15+rpi1) ...
Setting up debhelper (13.13) ...
Setting up llvm-16-tools (1:16.0.6-15+rpi1) ...
Setting up clang (1:16.0-57) ...
Setting up llvm (1:16.0-57) ...
Setting up llvm-16-dev (1:16.0.6-15+rpi1) ...
Setting up llvm-dev (1:16.0-57) ...
Setting up sbuild-build-depends-ccls-dummy (0.invalid.0) ...
Processing triggers for libc-bin (2.37-15~deb13u1+rpi1) ...
W: No sandbox user '_apt' on the system, can not drop privileges

+------------------------------------------------------------------------------+
| Build environment                                                            |
+------------------------------------------------------------------------------+

Kernel: Linux 4.15.0-187-generic armhf (armv8l)
Toolchain package versions: binutils_2.41-6+rpi1 dpkg-dev_1.22.4+rpi1 g++-12_12.3.0-14+rpi1 g++-13_13.2.0-9+rpi1 gcc-12_12.3.0-14+rpi1 gcc-13_13.2.0-9+rpi1 libc6-dev_2.37-15~deb13u1+rpi1 libstdc++-12-dev_12.3.0-14+rpi1 libstdc++-13-dev_13.2.0-9+rpi1 libstdc++6_13.2.0-9+rpi1 linux-libc-dev_6.5.6-1+rpi1+b1
Package versions: adduser_3.137 apt_2.7.11 autoconf_2.71-3 automake_1:1.16.5-1.3 autopoint_0.21-14 autotools-dev_20220109.1 base-files_13+rpi1 base-passwd_3.6.3 bash_5.2.21-2 binutils_2.41-6+rpi1 binutils-arm-linux-gnueabihf_2.41-6+rpi1 binutils-common_2.41-6+rpi1 bsdextrautils_2.39.3-6 bsdutils_1:2.39.3-6 build-essential_12.10 bzip2_1.0.8-5+b2 clang_1:16.0-57 clang-16_1:16.0.6-15+rpi1 cmake_3.28.3-1 cmake-data_3.28.3-1 coreutils_9.4-3 cpp_4:13.2.0-1+rpi1 cpp-12_12.3.0-14+rpi1 cpp-13_13.2.0-9+rpi1 dash_0.5.12-6 debconf_1.5.86 debhelper_13.13 debianutils_5.16 dh-autoreconf_20 dh-strip-nondeterminism_1.13.1-1 diffutils_1:3.10-1 dirmngr_2.2.40-1.1 dpkg_1.22.4+rpi1 dpkg-dev_1.22.4+rpi1 dwz_0.15-1 e2fsprogs_1.47.0-2 fakeroot_1.33-1 file_1:5.45-2 findutils_4.9.0-5 g++_4:13.2.0-1+rpi1 g++-12_12.3.0-14+rpi1 g++-13_13.2.0-9+rpi1 gcc_4:13.2.0-1+rpi1 gcc-12_12.3.0-14+rpi1 gcc-12-base_12.3.0-14+rpi1 gcc-13_13.2.0-9+rpi1 gcc-13-base_13.2.0-9+rpi1 gcc-7-base_7.5.0-6+rpi1+b2 gcc-8-base_8.4.0-7+rpi1 gcc-9-base_9.4.0-2+rpi1 gettext_0.21-14 gettext-base_0.21-14 gnupg_2.2.40-1.1 gnupg-l10n_2.2.40-1.1 gnupg-utils_2.2.40-1.1 gpg_2.2.40-1.1 gpg-agent_2.2.40-1.1 gpg-wks-client_2.2.40-1.1 gpg-wks-server_2.2.40-1.1 gpgconf_2.2.40-1.1 gpgsm_2.2.40-1.1 gpgv_2.2.40-1.1 grep_3.11-4 groff-base_1.23.0-3 gzip_1.12-1 hostname_3.23+nmu2 icu-devtools_72.1-4 init-system-helpers_1.66 intltool-debian_0.35.0+20060710.6 iputils-ping_3:20240117-1 krb5-locales_1.20.1-5 libacl1_2.3.2-1 libapt-pkg6.0_2.7.11 libarchive-zip-perl_1.68-1 libarchive13_3.7.2-1 libasan8_13.2.0-9+rpi1 libassuan0_2.5.6-1 libatomic1_13.2.0-9+rpi1 libattr1_1:2.5.2-1 libaudit-common_1:3.1.2-2 libaudit1_1:3.1.2-2 libbinutils_2.41-6+rpi1 libblkid1_2.39.3-6 libbrotli1_1.1.0-2 libbsd0_0.11.8-1 libbz2-1.0_1.0.8-5+b2 libc-bin_2.37-15~deb13u1+rpi1 libc-dev-bin_2.37-15~deb13u1+rpi1 libc6_2.37-15~deb13u1+rpi1 libc6-dev_2.37-15~deb13u1+rpi1 libcap-ng0_0.8.4-2 libcap2_1:2.66-5 libcap2-bin_1:2.66-5 libcc1-0_13.2.0-9+rpi1 libclang-16-dev_1:16.0.6-15+rpi1 libclang-common-16-dev_1:16.0.6-15+rpi1 libclang-cpp16_1:16.0.6-15+rpi1 libclang-dev_1:16.0-57 libclang1-16_1:16.0.6-15+rpi1 libcom-err2_1.47.0-2 libcrypt-dev_1:4.4.36-4 libcrypt1_1:4.4.36-4 libctf-nobfd0_2.41-6+rpi1 libctf0_2.41-6+rpi1 libcurl4_8.5.0-2+rpi1 libdb5.3_5.3.28+dfsg2-4 libdebconfclient0_0.271 libdebhelper-perl_13.13 libdpkg-perl_1.22.4+rpi1 libedit2_3.1-20230828-1 libelf1_0.188-2.1+rpi1 libexpat1_2.5.0-2 libext2fs2_1.47.0-2 libfakeroot_1.33-1 libffi-dev_3.4.4-2 libffi8_3.4.4-2 libfile-find-rule-perl_0.34-3 libfile-stripnondeterminism-perl_1.13.1-1 libgc1_1:8.2.6-1 libgcc-12-dev_12.3.0-14+rpi1 libgcc-13-dev_13.2.0-9+rpi1 libgcc-s1_13.2.0-9+rpi1 libgcrypt20_1.10.3-2 libgdbm-compat4_1.23-5 libgdbm6_1.23-5 libgmp10_2:6.3.0+dfsg-2 libgnutls30_3.8.3-1 libgomp1_13.2.0-9+rpi1 libgpg-error0_1.47-3 libgssapi-krb5-2_1.20.1-5 libhogweed6_3.9.1-2 libicu-dev_72.1-4 libicu72_72.1-4 libidn2-0_2.3.7-2 libisl23_0.26-3 libjansson4_2.14-2 libjsoncpp25_1.9.5-6 libk5crypto3_1.20.1-5 libkeyutils1_1.6.3-3 libkrb5-3_1.20.1-5 libkrb5support0_1.20.1-5 libksba8_1.6.5-2 libldap-2.5-0_2.5.13+dfsg-5+rpi1+b1 libllvm16_1:16.0.6-15+rpi1 liblz4-1_1.9.4-1+rpi1+b1 liblzma5_5.4.5-0.3 libmagic-mgc_1:5.45-2 libmagic1_1:5.45-2 libmd0_1.1.0-2 libmount1_2.39.3-6 libmpc3_1.3.1-1 libmpfr6_4.2.1-1 libncurses-dev_6.4+20240113-1 libncurses6_6.4+20240113-1 libncursesw6_6.4+20240113-1 libnettle8_3.9.1-2 libnghttp2-14_1.59.0-1 libnpth0_1.6-3 libnsl-dev_1.3.0-3 libnsl2_1.3.0-3 libnumber-compare-perl_0.03-3 libobjc-12-dev_12.3.0-14+rpi1 libobjc4_13.2.0-9+rpi1 libp11-kit0_0.25.3-4 libpam-cap_1:2.66-5 libpam-modules_1.5.2-9.1 libpam-modules-bin_1.5.2-9.1 libpam-runtime_1.5.2-9.1 libpam0g_1.5.2-9.1 libpcre2-8-0_10.42-4 libpcre3_2:8.39-15 libperl5.38_5.38.2-3 libpfm4_4.13.0+git16-g535c204-1 libpipeline1_1.5.7-1 libproc2-0_2:4.0.4-4 libpsl5_0.21.2-1+b1 libpython3-stdlib_3.11.6-1 libpython3.11-minimal_3.11.8-1 libpython3.11-stdlib_3.11.8-1 libreadline8_8.2-3 librhash0_1.4.3-3 librtmp1_2.4+20151223.gitfa8646d.1-2+b2 libsasl2-2_2.1.28+dfsg1-4 libsasl2-modules-db_2.1.28+dfsg1-4 libseccomp2_2.5.5-1+rpi1 libselinux1_3.5-2 libsemanage-common_3.5-1 libsemanage2_3.5-1 libsepol1_3.1-1 libsepol2_3.5-2 libsframe1_2.41-6+rpi1 libsmartcols1_2.39.3-6 libsqlite3-0_3.45.1-1 libss2_1.47.0-2 libssh2-1_1.11.0-4 libssl1.1_1.1.1o-1 libssl3_3.1.5-1 libstdc++-12-dev_12.3.0-14+rpi1 libstdc++-13-dev_13.2.0-9+rpi1 libstdc++6_13.2.0-9+rpi1 libsub-override-perl_0.10-1 libsystemd0_255.3-1+rpi1 libtasn1-6_4.19.0-3 libtext-glob-perl_0.11-3 libtinfo6_6.4+20240113-1 libtirpc-common_1.3.4+ds-1 libtirpc-dev_1.3.4+ds-1 libtirpc3_1.3.4+ds-1 libtool_2.4.7-7 libubsan1_13.2.0-9+rpi1 libuchardet0_0.0.8-1 libudev1_255.3-1+rpi1 libunistring2_1.0-2 libunistring5_1.1-2 libuuid1_2.39.3-6 libuv1_1.46.0-3+rpi1 libxml2_2.9.14+dfsg-1.3 libxml2-dev_2.9.14+dfsg-1.3 libxxhash0_0.8.2-2 libyaml-0-2_0.2.5-1 libz3-4_4.8.12-3.1 libz3-dev_4.8.12-3.1 libzstd1_1.5.5+dfsg2-2 linux-libc-dev_6.5.6-1+rpi1+b1 llvm_1:16.0-57 llvm-16_1:16.0.6-15+rpi1 llvm-16-dev_1:16.0.6-15+rpi1 llvm-16-linker-tools_1:16.0.6-15+rpi1 llvm-16-runtime_1:16.0.6-15+rpi1 llvm-16-tools_1:16.0.6-15+rpi1 llvm-dev_1:16.0-57 llvm-runtime_1:16.0-57 login_1:4.13+dfsg1-3 logsave_1.47.0-2 lsb-base_11.6+rpi1 m4_1.4.19-4 make_4.3-4.1 man-db_2.12.0-3 mawk_1.3.4.20240123-1 media-types_10.1.0 mount_2.39.3-6 nano_7.2-2 ncurses-base_6.4+20240113-1 ncurses-bin_6.4+20240113-1 netbase_6.4 passwd_1:4.13+dfsg1-3 patch_2.7.6-7 perl_5.38.2-3 perl-base_5.38.2-3 perl-modules-5.38_5.38.2-3 pinentry-curses_1.2.1-3 po-debconf_1.0.21+nmu1 procps_2:4.0.4-4 python3_3.11.6-1 python3-minimal_3.11.6-1 python3-pkg-resources_68.1.2-2 python3-pygments_2.17.2+dfsg-1 python3-yaml_6.0.1-2 python3.11_3.11.8-1 python3.11-minimal_3.11.8-1 rapidjson-dev_1.1.0+dfsg2-7.1 raspbian-archive-keyring_20120528.2 readline-common_8.2-3 rpcsvc-proto_1.4.3-1 sbuild-build-depends-ccls-dummy_0.invalid.0 sbuild-build-depends-core-dummy_0.invalid.0 sed_4.9-2 sensible-utils_0.0.22 sgml-base_1.31 sysvinit-utils_3.08-6 tar_1.35+dfsg-3 tzdata_2024a-1 usrmerge_39 util-linux_2.39.3-6 util-linux-extra_2.39.3-6 xz-utils_5.4.5-0.3 zlib1g_1:1.3.dfsg-3

+------------------------------------------------------------------------------+
| Build                                                                        |
+------------------------------------------------------------------------------+


Unpack source
-------------

gpgv: Signature made Sun Sep 17 19:43:47 2023 UTC
gpgv:                using EDDSA key 9185D4F57767AEEE6C55D41E7F44FA25EA5514CB
gpgv: Can't check signature: No public key
dpkg-source: warning: cannot verify inline signature for ./ccls_0.20230717-1.dsc: no acceptable signature found
dpkg-source: info: extracting ccls in /<<PKGBUILDDIR>>
dpkg-source: info: unpacking ccls_0.20230717.orig.tar.gz
dpkg-source: info: unpacking ccls_0.20230717-1.debian.tar.xz

Check disk space
----------------

Sufficient free space for build

User Environment
----------------

APT_CONFIG=/var/lib/sbuild/apt.conf
DEB_BUILD_OPTIONS=parallel=4
HOME=/sbuild-nonexistent
LC_ALL=POSIX
LOGNAME=buildd
PATH=/usr/local/sbin:/usr/local/bin:/usr/sbin:/usr/bin:/sbin:/bin:/usr/games
SCHROOT_ALIAS_NAME=trixie-staging-armhf-sbuild
SCHROOT_CHROOT_NAME=trixie-staging-armhf-sbuild
SCHROOT_COMMAND=env
SCHROOT_GID=112
SCHROOT_GROUP=buildd
SCHROOT_SESSION_ID=trixie-staging-armhf-sbuild-6d78f7f2-4b37-4dbd-ad80-231e1c615cfe
SCHROOT_UID=107
SCHROOT_USER=buildd
SHELL=/bin/sh
USER=buildd

dpkg-buildpackage
-----------------

dpkg-buildpackage: info: source package ccls
dpkg-buildpackage: info: source version 0.20230717-1
dpkg-buildpackage: info: source distribution unstable
 dpkg-source --before-build .
dpkg-buildpackage: info: host architecture armhf
 debian/rules clean
dh clean
   dh_clean
 debian/rules binary-arch
dh binary-arch
   dh_update_autotools_config -a
   dh_autoreconf -a
   debian/rules override_dh_auto_configure
make[1]: Entering directory '/<<PKGBUILDDIR>>'
dh_auto_configure -- -DCCLS_VERSION=0.20230717-1 -DCLANG_RESOURCE_DIR=/usr/include/clang/16
	cd obj-arm-linux-gnueabihf && DEB_PYTHON_INSTALL_LAYOUT=deb cmake -DCMAKE_INSTALL_PREFIX=/usr -DCMAKE_BUILD_TYPE=None -DCMAKE_INSTALL_SYSCONFDIR=/etc -DCMAKE_INSTALL_LOCALSTATEDIR=/var -DCMAKE_EXPORT_NO_PACKAGE_REGISTRY=ON -DCMAKE_FIND_USE_PACKAGE_REGISTRY=OFF -DCMAKE_FIND_PACKAGE_NO_PACKAGE_REGISTRY=ON -DFETCHCONTENT_FULLY_DISCONNECTED=ON -DCMAKE_INSTALL_RUNSTATEDIR=/run -DCMAKE_SKIP_INSTALL_ALL_DEPENDENCY=ON "-GUnix Makefiles" -DCMAKE_VERBOSE_MAKEFILE=ON -DCMAKE_INSTALL_LIBDIR=lib/arm-linux-gnueabihf -DCCLS_VERSION=0.20230717-1 -DCLANG_RESOURCE_DIR=/usr/include/clang/16 ..
-- The CXX compiler identification is GNU 13.2.0
-- The C compiler identification is GNU 13.2.0
-- Detecting CXX compiler ABI info
-- Detecting CXX compiler ABI info - done
-- Check for working CXX compiler: /usr/bin/c++ - skipped
-- Detecting CXX compile features
-- Detecting CXX compile features - done
-- Detecting C compiler ABI info
-- Detecting C compiler ABI info - done
-- Check for working C compiler: /usr/bin/cc - skipped
-- Detecting C compile features
-- Detecting C compile features - done
-- Performing Test HAVE_FFI_CALL
-- Performing Test HAVE_FFI_CALL - Success
-- Found FFI: /usr/lib/arm-linux-gnueabihf/libffi.so  
-- Performing Test Terminfo_LINKABLE
-- Performing Test Terminfo_LINKABLE - Success
-- Found Terminfo: /usr/lib/arm-linux-gnueabihf/libtinfo.so  
-- Could NOT find ZLIB (missing: ZLIB_LIBRARY ZLIB_INCLUDE_DIR) 
-- Could NOT find zstd (missing: zstd_LIBRARY zstd_INCLUDE_DIR) 
-- Found LibXml2: /usr/lib/arm-linux-gnueabihf/libxml2.so (found version "2.9.14") 
-- Could NOT find CURL (missing: CURL_LIBRARY CURL_INCLUDE_DIR) 
-- Performing Test CMAKE_HAVE_LIBC_PTHREAD
-- Performing Test CMAKE_HAVE_LIBC_PTHREAD - Success
-- Found Threads: TRUE  
-- Could NOT find ZLIB (missing: ZLIB_LIBRARY ZLIB_INCLUDE_DIR) 
-- RapidJSON found. Headers: /usr/include
-- Configuring done (2.9s)
-- Generating done (0.0s)
CMake Warning:
  Manually-specified variables were not used by the project:

    CMAKE_EXPORT_NO_PACKAGE_REGISTRY
    CMAKE_FIND_PACKAGE_NO_PACKAGE_REGISTRY
    CMAKE_INSTALL_LIBDIR
    CMAKE_INSTALL_LOCALSTATEDIR
    CMAKE_INSTALL_RUNSTATEDIR
    CMAKE_INSTALL_SYSCONFDIR
    FETCHCONTENT_FULLY_DISCONNECTED


-- Build files have been written to: /<<PKGBUILDDIR>>/obj-arm-linux-gnueabihf
make[1]: Leaving directory '/<<PKGBUILDDIR>>'
   dh_auto_build -a
	cd obj-arm-linux-gnueabihf && make -j4 "INSTALL=install --strip-program=true" VERBOSE=1
make[1]: Entering directory '/<<PKGBUILDDIR>>/obj-arm-linux-gnueabihf'
/usr/bin/cmake -S/<<PKGBUILDDIR>> -B/<<PKGBUILDDIR>>/obj-arm-linux-gnueabihf --check-build-system CMakeFiles/Makefile.cmake 0
/usr/bin/cmake -E cmake_progress_start /<<PKGBUILDDIR>>/obj-arm-linux-gnueabihf/CMakeFiles /<<PKGBUILDDIR>>/obj-arm-linux-gnueabihf//CMakeFiles/progress.marks
make  -f CMakeFiles/Makefile2 all
make[2]: Entering directory '/<<PKGBUILDDIR>>/obj-arm-linux-gnueabihf'
make  -f CMakeFiles/ccls.dir/build.make CMakeFiles/ccls.dir/depend
make[3]: Entering directory '/<<PKGBUILDDIR>>/obj-arm-linux-gnueabihf'
cd /<<PKGBUILDDIR>>/obj-arm-linux-gnueabihf && /usr/bin/cmake -E cmake_depends "Unix Makefiles" /<<PKGBUILDDIR>> /<<PKGBUILDDIR>> /<<PKGBUILDDIR>>/obj-arm-linux-gnueabihf /<<PKGBUILDDIR>>/obj-arm-linux-gnueabihf /<<PKGBUILDDIR>>/obj-arm-linux-gnueabihf/CMakeFiles/ccls.dir/DependInfo.cmake "--color="
make[3]: Leaving directory '/<<PKGBUILDDIR>>/obj-arm-linux-gnueabihf'
make  -f CMakeFiles/ccls.dir/build.make CMakeFiles/ccls.dir/build
make[3]: Entering directory '/<<PKGBUILDDIR>>/obj-arm-linux-gnueabihf'
[  9%] Building CXX object CMakeFiles/ccls.dir/src/filesystem.cc.o
[  9%] Building CXX object CMakeFiles/ccls.dir/src/config.cc.o
[  9%] Building CXX object CMakeFiles/ccls.dir/src/clang_tu.cc.o
[  9%] Building CXX object CMakeFiles/ccls.dir/third_party/siphash.cc.o
/usr/bin/c++  -I/<<PKGBUILDDIR>>/src -isystem /<<PKGBUILDDIR>>/third_party -isystem /usr/lib/llvm-16/include -g -O2 -ffile-prefix-map=/<<PKGBUILDDIR>>=. -fstack-protector-strong -fstack-clash-protection -Wformat -Werror=format-security -Wdate-time -D_FORTIFY_SOURCE=2 -std=c++17 -Wall -Wno-sign-compare -Wno-return-type -Wno-unused-result -MD -MT CMakeFiles/ccls.dir/third_party/siphash.cc.o -MF CMakeFiles/ccls.dir/third_party/siphash.cc.o.d -o CMakeFiles/ccls.dir/third_party/siphash.cc.o -c /<<PKGBUILDDIR>>/third_party/siphash.cc
/usr/bin/c++  -I/<<PKGBUILDDIR>>/src -isystem /<<PKGBUILDDIR>>/third_party -isystem /usr/lib/llvm-16/include -g -O2 -ffile-prefix-map=/<<PKGBUILDDIR>>=. -fstack-protector-strong -fstack-clash-protection -Wformat -Werror=format-security -Wdate-time -D_FORTIFY_SOURCE=2 -std=c++17 -Wall -Wno-sign-compare -Wno-return-type -Wno-unused-result -MD -MT CMakeFiles/ccls.dir/src/clang_tu.cc.o -MF CMakeFiles/ccls.dir/src/clang_tu.cc.o.d -o CMakeFiles/ccls.dir/src/clang_tu.cc.o -c /<<PKGBUILDDIR>>/src/clang_tu.cc
/usr/bin/c++  -I/<<PKGBUILDDIR>>/src -isystem /<<PKGBUILDDIR>>/third_party -isystem /usr/lib/llvm-16/include -g -O2 -ffile-prefix-map=/<<PKGBUILDDIR>>=. -fstack-protector-strong -fstack-clash-protection -Wformat -Werror=format-security -Wdate-time -D_FORTIFY_SOURCE=2 -std=c++17 -Wall -Wno-sign-compare -Wno-return-type -Wno-unused-result -MD -MT CMakeFiles/ccls.dir/src/config.cc.o -MF CMakeFiles/ccls.dir/src/config.cc.o.d -o CMakeFiles/ccls.dir/src/config.cc.o -c /<<PKGBUILDDIR>>/src/config.cc
/usr/bin/c++  -I/<<PKGBUILDDIR>>/src -isystem /<<PKGBUILDDIR>>/third_party -isystem /usr/lib/llvm-16/include -g -O2 -ffile-prefix-map=/<<PKGBUILDDIR>>=. -fstack-protector-strong -fstack-clash-protection -Wformat -Werror=format-security -Wdate-time -D_FORTIFY_SOURCE=2 -std=c++17 -Wall -Wno-sign-compare -Wno-return-type -Wno-unused-result -MD -MT CMakeFiles/ccls.dir/src/filesystem.cc.o -MF CMakeFiles/ccls.dir/src/filesystem.cc.o.d -o CMakeFiles/ccls.dir/src/filesystem.cc.o -c /<<PKGBUILDDIR>>/src/filesystem.cc
[ 11%] Building CXX object CMakeFiles/ccls.dir/src/fuzzy_match.cc.o
/usr/bin/c++  -I/<<PKGBUILDDIR>>/src -isystem /<<PKGBUILDDIR>>/third_party -isystem /usr/lib/llvm-16/include -g -O2 -ffile-prefix-map=/<<PKGBUILDDIR>>=. -fstack-protector-strong -fstack-clash-protection -Wformat -Werror=format-security -Wdate-time -D_FORTIFY_SOURCE=2 -std=c++17 -Wall -Wno-sign-compare -Wno-return-type -Wno-unused-result -MD -MT CMakeFiles/ccls.dir/src/fuzzy_match.cc.o -MF CMakeFiles/ccls.dir/src/fuzzy_match.cc.o.d -o CMakeFiles/ccls.dir/src/fuzzy_match.cc.o -c /<<PKGBUILDDIR>>/src/fuzzy_match.cc
[ 13%] Building CXX object CMakeFiles/ccls.dir/src/main.cc.o
/usr/bin/c++  -DCCLS_VERSION=\"0.20230717-1\" -I/<<PKGBUILDDIR>>/src -isystem /<<PKGBUILDDIR>>/third_party -isystem /usr/lib/llvm-16/include -g -O2 -ffile-prefix-map=/<<PKGBUILDDIR>>=. -fstack-protector-strong -fstack-clash-protection -Wformat -Werror=format-security -Wdate-time -D_FORTIFY_SOURCE=2 -std=c++17 -Wall -Wno-sign-compare -Wno-return-type -Wno-unused-result -MD -MT CMakeFiles/ccls.dir/src/main.cc.o -MF CMakeFiles/ccls.dir/src/main.cc.o.d -o CMakeFiles/ccls.dir/src/main.cc.o -c /<<PKGBUILDDIR>>/src/main.cc
[ 16%] Building CXX object CMakeFiles/ccls.dir/src/include_complete.cc.o
/usr/bin/c++  -I/<<PKGBUILDDIR>>/src -isystem /<<PKGBUILDDIR>>/third_party -isystem /usr/lib/llvm-16/include -g -O2 -ffile-prefix-map=/<<PKGBUILDDIR>>=. -fstack-protector-strong -fstack-clash-protection -Wformat -Werror=format-security -Wdate-time -D_FORTIFY_SOURCE=2 -std=c++17 -Wall -Wno-sign-compare -Wno-return-type -Wno-unused-result -MD -MT CMakeFiles/ccls.dir/src/include_complete.cc.o -MF CMakeFiles/ccls.dir/src/include_complete.cc.o.d -o CMakeFiles/ccls.dir/src/include_complete.cc.o -c /<<PKGBUILDDIR>>/src/include_complete.cc
In file included from /usr/include/c++/13/set:63,
                 from /<<PKGBUILDDIR>>/src/filesystem.cc:9:
/usr/include/c++/13/bits/stl_set.h: In constructor 'std::set<_Key, _Compare, _Alloc>::set(std::initializer_list<_Tp>, const _Compare&, const allocator_type&) [with _Key = llvm::sys::fs::UniqueID; _Compare = std::less<llvm::sys::fs::UniqueID>; _Alloc = std::allocator<llvm::sys::fs::UniqueID>]':
/usr/include/c++/13/bits/stl_set.h:245:7: note: parameter passing for argument of type 'std::initializer_list<llvm::sys::fs::UniqueID>' changed in GCC 7.1
  245 |       set(initializer_list<value_type> __l,
      |       ^~~
/<<PKGBUILDDIR>>/src/filesystem.cc: In function 'void getFilesInFolder(std::string, bool, bool, const std::function<void(const std::__cxx11::basic_string<char>&)>&)':
/<<PKGBUILDDIR>>/src/filesystem.cc:21:56: note: parameter passing for argument of type 'std::initializer_list<llvm::sys::fs::UniqueID>' changed in GCC 7.1
   21 |   std::set<sys::fs::UniqueID> seen{status.getUniqueID()};
      |                                                        ^
[ 18%] Building CXX object CMakeFiles/ccls.dir/src/indexer.cc.o
/usr/bin/c++  -I/<<PKGBUILDDIR>>/src -isystem /<<PKGBUILDDIR>>/third_party -isystem /usr/lib/llvm-16/include -g -O2 -ffile-prefix-map=/<<PKGBUILDDIR>>=. -fstack-protector-strong -fstack-clash-protection -Wformat -Werror=format-security -Wdate-time -D_FORTIFY_SOURCE=2 -std=c++17 -Wall -Wno-sign-compare -Wno-return-type -Wno-unused-result -MD -MT CMakeFiles/ccls.dir/src/indexer.cc.o -MF CMakeFiles/ccls.dir/src/indexer.cc.o.d -o CMakeFiles/ccls.dir/src/indexer.cc.o -c /<<PKGBUILDDIR>>/src/indexer.cc
[ 20%] Building CXX object CMakeFiles/ccls.dir/src/log.cc.o
/usr/bin/c++  -I/<<PKGBUILDDIR>>/src -isystem /<<PKGBUILDDIR>>/third_party -isystem /usr/lib/llvm-16/include -g -O2 -ffile-prefix-map=/<<PKGBUILDDIR>>=. -fstack-protector-strong -fstack-clash-protection -Wformat -Werror=format-security -Wdate-time -D_FORTIFY_SOURCE=2 -std=c++17 -Wall -Wno-sign-compare -Wno-return-type -Wno-unused-result -MD -MT CMakeFiles/ccls.dir/src/log.cc.o -MF CMakeFiles/ccls.dir/src/log.cc.o.d -o CMakeFiles/ccls.dir/src/log.cc.o -c /<<PKGBUILDDIR>>/src/log.cc
[ 23%] Building CXX object CMakeFiles/ccls.dir/src/lsp.cc.o
/usr/bin/c++  -I/<<PKGBUILDDIR>>/src -isystem /<<PKGBUILDDIR>>/third_party -isystem /usr/lib/llvm-16/include -g -O2 -ffile-prefix-map=/<<PKGBUILDDIR>>=. -fstack-protector-strong -fstack-clash-protection -Wformat -Werror=format-security -Wdate-time -D_FORTIFY_SOURCE=2 -std=c++17 -Wall -Wno-sign-compare -Wno-return-type -Wno-unused-result -MD -MT CMakeFiles/ccls.dir/src/lsp.cc.o -MF CMakeFiles/ccls.dir/src/lsp.cc.o.d -o CMakeFiles/ccls.dir/src/lsp.cc.o -c /<<PKGBUILDDIR>>/src/lsp.cc
[ 25%] Building CXX object CMakeFiles/ccls.dir/src/message_handler.cc.o
/usr/bin/c++  -I/<<PKGBUILDDIR>>/src -isystem /<<PKGBUILDDIR>>/third_party -isystem /usr/lib/llvm-16/include -g -O2 -ffile-prefix-map=/<<PKGBUILDDIR>>=. -fstack-protector-strong -fstack-clash-protection -Wformat -Werror=format-security -Wdate-time -D_FORTIFY_SOURCE=2 -std=c++17 -Wall -Wno-sign-compare -Wno-return-type -Wno-unused-result -MD -MT CMakeFiles/ccls.dir/src/message_handler.cc.o -MF CMakeFiles/ccls.dir/src/message_handler.cc.o.d -o CMakeFiles/ccls.dir/src/message_handler.cc.o -c /<<PKGBUILDDIR>>/src/message_handler.cc
[ 27%] Building CXX object CMakeFiles/ccls.dir/src/pipeline.cc.o
/usr/bin/c++  -I/<<PKGBUILDDIR>>/src -isystem /<<PKGBUILDDIR>>/third_party -isystem /usr/lib/llvm-16/include -g -O2 -ffile-prefix-map=/<<PKGBUILDDIR>>=. -fstack-protector-strong -fstack-clash-protection -Wformat -Werror=format-security -Wdate-time -D_FORTIFY_SOURCE=2 -std=c++17 -Wall -Wno-sign-compare -Wno-return-type -Wno-unused-result -MD -MT CMakeFiles/ccls.dir/src/pipeline.cc.o -MF CMakeFiles/ccls.dir/src/pipeline.cc.o.d -o CMakeFiles/ccls.dir/src/pipeline.cc.o -c /<<PKGBUILDDIR>>/src/pipeline.cc
[ 30%] Building CXX object CMakeFiles/ccls.dir/src/platform_posix.cc.o
/usr/bin/c++  -I/<<PKGBUILDDIR>>/src -isystem /<<PKGBUILDDIR>>/third_party -isystem /usr/lib/llvm-16/include -g -O2 -ffile-prefix-map=/<<PKGBUILDDIR>>=. -fstack-protector-strong -fstack-clash-protection -Wformat -Werror=format-security -Wdate-time -D_FORTIFY_SOURCE=2 -std=c++17 -Wall -Wno-sign-compare -Wno-return-type -Wno-unused-result -MD -MT CMakeFiles/ccls.dir/src/platform_posix.cc.o -MF CMakeFiles/ccls.dir/src/platform_posix.cc.o.d -o CMakeFiles/ccls.dir/src/platform_posix.cc.o -c /<<PKGBUILDDIR>>/src/platform_posix.cc
[ 32%] Building CXX object CMakeFiles/ccls.dir/src/platform_win.cc.o
/usr/bin/c++  -I/<<PKGBUILDDIR>>/src -isystem /<<PKGBUILDDIR>>/third_party -isystem /usr/lib/llvm-16/include -g -O2 -ffile-prefix-map=/<<PKGBUILDDIR>>=. -fstack-protector-strong -fstack-clash-protection -Wformat -Werror=format-security -Wdate-time -D_FORTIFY_SOURCE=2 -std=c++17 -Wall -Wno-sign-compare -Wno-return-type -Wno-unused-result -MD -MT CMakeFiles/ccls.dir/src/platform_win.cc.o -MF CMakeFiles/ccls.dir/src/platform_win.cc.o.d -o CMakeFiles/ccls.dir/src/platform_win.cc.o -c /<<PKGBUILDDIR>>/src/platform_win.cc
[ 34%] Building CXX object CMakeFiles/ccls.dir/src/position.cc.o
/usr/bin/c++  -I/<<PKGBUILDDIR>>/src -isystem /<<PKGBUILDDIR>>/third_party -isystem /usr/lib/llvm-16/include -g -O2 -ffile-prefix-map=/<<PKGBUILDDIR>>=. -fstack-protector-strong -fstack-clash-protection -Wformat -Werror=format-security -Wdate-time -D_FORTIFY_SOURCE=2 -std=c++17 -Wall -Wno-sign-compare -Wno-return-type -Wno-unused-result -MD -MT CMakeFiles/ccls.dir/src/position.cc.o -MF CMakeFiles/ccls.dir/src/position.cc.o.d -o CMakeFiles/ccls.dir/src/position.cc.o -c /<<PKGBUILDDIR>>/src/position.cc
[ 37%] Building CXX object CMakeFiles/ccls.dir/src/project.cc.o
/usr/bin/c++  -I/<<PKGBUILDDIR>>/src -isystem /<<PKGBUILDDIR>>/third_party -isystem /usr/lib/llvm-16/include -g -O2 -ffile-prefix-map=/<<PKGBUILDDIR>>=. -fstack-protector-strong -fstack-clash-protection -Wformat -Werror=format-security -Wdate-time -D_FORTIFY_SOURCE=2 -std=c++17 -Wall -Wno-sign-compare -Wno-return-type -Wno-unused-result -MD -MT CMakeFiles/ccls.dir/src/project.cc.o -MF CMakeFiles/ccls.dir/src/project.cc.o.d -o CMakeFiles/ccls.dir/src/project.cc.o -c /<<PKGBUILDDIR>>/src/project.cc
[ 39%] Building CXX object CMakeFiles/ccls.dir/src/query.cc.o
/usr/bin/c++  -I/<<PKGBUILDDIR>>/src -isystem /<<PKGBUILDDIR>>/third_party -isystem /usr/lib/llvm-16/include -g -O2 -ffile-prefix-map=/<<PKGBUILDDIR>>=. -fstack-protector-strong -fstack-clash-protection -Wformat -Werror=format-security -Wdate-time -D_FORTIFY_SOURCE=2 -std=c++17 -Wall -Wno-sign-compare -Wno-return-type -Wno-unused-result -MD -MT CMakeFiles/ccls.dir/src/query.cc.o -MF CMakeFiles/ccls.dir/src/query.cc.o.d -o CMakeFiles/ccls.dir/src/query.cc.o -c /<<PKGBUILDDIR>>/src/query.cc
In file included from /usr/include/c++/13/vector:72,
                 from /<<PKGBUILDDIR>>/src/utils.hh:13,
                 from /<<PKGBUILDDIR>>/src/serializer.hh:6,
                 from /<<PKGBUILDDIR>>/src/config.hh:6,
                 from /<<PKGBUILDDIR>>/src/lsp.hh:6,
                 from /<<PKGBUILDDIR>>/src/indexer.hh:6,
                 from /<<PKGBUILDDIR>>/src/indexer.cc:4:
/usr/include/c++/13/bits/vector.tcc: In member function 'void std::vector<_Tp, _Alloc>::_M_realloc_insert(iterator, _Args&& ...) [with _Args = {long long unsigned int, int&}; _Tp = std::pair<long long unsigned int, long long int>; _Alloc = std::allocator<std::pair<long long unsigned int, long long int> >]':
/usr/include/c++/13/bits/vector.tcc:445:7: note: parameter passing for argument of type 'std::vector<std::pair<long long unsigned int, long long int>, std::allocator<std::pair<long long unsigned int, long long int> > >::iterator' changed in GCC 7.1
  445 |       vector<_Tp, _Alloc>::
      |       ^~~~~~~~~~~~~~~~~~~
/usr/include/c++/13/bits/vector.tcc: In member function 'void std::vector<_Tp, _Alloc>::_M_realloc_insert(iterator, _Args&& ...) [with _Args = {const long long unsigned int&}; _Tp = long long unsigned int; _Alloc = std::allocator<long long unsigned int>]':
/usr/include/c++/13/bits/vector.tcc:445:7: note: parameter passing for argument of type 'std::vector<long long unsigned int, std::allocator<long long unsigned int> >::iterator' changed in GCC 7.1
In file included from /usr/include/c++/13/vector:66:
/usr/include/c++/13/bits/stl_vector.h: In member function 'void std::vector<_Tp, _Alloc>::push_back(const value_type&) [with _Tp = long long unsigned int; _Alloc = std::allocator<long long unsigned int>]':
/usr/include/c++/13/bits/stl_vector.h:1289:28: note: parameter passing for argument of type '__gnu_cxx::__normal_iterator<long long unsigned int*, std::vector<long long unsigned int, std::allocator<long long unsigned int> > >' changed in GCC 7.1
 1289 |           _M_realloc_insert(end(), __x);
      |           ~~~~~~~~~~~~~~~~~^~~~~~~~~~~~
/usr/include/c++/13/bits/vector.tcc: In member function 'void std::vector<_Tp, _Alloc>::_M_realloc_insert(iterator, _Args&& ...) [with _Args = {long long unsigned int&, int}; _Tp = std::pair<long long unsigned int, long long int>; _Alloc = std::allocator<std::pair<long long unsigned int, long long int> >]':
/usr/include/c++/13/bits/vector.tcc:445:7: note: parameter passing for argument of type 'std::vector<std::pair<long long unsigned int, long long int>, std::allocator<std::pair<long long unsigned int, long long int> > >::iterator' changed in GCC 7.1
  445 |       vector<_Tp, _Alloc>::
      |       ^~~~~~~~~~~~~~~~~~~
In file included from /usr/include/c++/13/vector:72,
                 from /<<PKGBUILDDIR>>/src/utils.hh:13,
                 from /<<PKGBUILDDIR>>/src/serializer.hh:6,
                 from /<<PKGBUILDDIR>>/src/config.hh:6,
                 from /<<PKGBUILDDIR>>/src/lsp.hh:6,
                 from /<<PKGBUILDDIR>>/src/indexer.hh:6,
                 from /<<PKGBUILDDIR>>/src/query.hh:6,
                 from /<<PKGBUILDDIR>>/src/query.cc:4:
/usr/include/c++/13/bits/vector.tcc: In function 'void std::vector<_Tp, _Alloc>::_M_range_insert(iterator, _ForwardIterator, _ForwardIterator, std::forward_iterator_tag) [with _ForwardIterator = __gnu_cxx::__normal_iterator<const long long unsigned int*, std::vector<long long unsigned int, std::allocator<long long unsigned int> > >; _Tp = long long unsigned int; _Alloc = std::allocator<long long unsigned int>]':
/usr/include/c++/13/bits/vector.tcc:751:7: note: parameter passing for argument of type 'std::vector<long long unsigned int, std::allocator<long long unsigned int> >::iterator' changed in GCC 7.1
  751 |       vector<_Tp, _Alloc>::
      |       ^~~~~~~~~~~~~~~~~~~
/usr/include/c++/13/bits/vector.tcc:751:7: note: parameter passing for argument of type '__gnu_cxx::__normal_iterator<const long long unsigned int*, std::vector<long long unsigned int, std::allocator<long long unsigned int> > >' changed in GCC 7.1
/usr/include/c++/13/bits/vector.tcc:751:7: note: parameter passing for argument of type '__gnu_cxx::__normal_iterator<const long long unsigned int*, std::vector<long long unsigned int, std::allocator<long long unsigned int> > >' changed in GCC 7.1
In file included from /usr/include/c++/13/functional:67,
                 from /<<PKGBUILDDIR>>/src/serializer.hh:14:
/usr/include/c++/13/bits/stl_algo.h: In function 'void std::__unguarded_linear_insert(_RandomAccessIterator, _Compare) [with _RandomAccessIterator = __gnu_cxx::__normal_iterator<ccls::SymbolRef*, vector<ccls::SymbolRef, allocator<ccls::SymbolRef> > >; _Compare = __gnu_cxx::__ops::_Val_comp_iter<ccls::findSymbolsAtLocation(WorkingFile*, QueryFile*, Position&, bool)::<lambda(const ccls::SymbolRef&, const ccls::SymbolRef&)> >]':
/usr/include/c++/13/bits/stl_algo.h:1792:5: note: parameter passing for argument of type '__gnu_cxx::__normal_iterator<ccls::SymbolRef*, std::vector<ccls::SymbolRef, std::allocator<ccls::SymbolRef> > >' changed in GCC 7.1
 1792 |     __unguarded_linear_insert(_RandomAccessIterator __last,
      |     ^~~~~~~~~~~~~~~~~~~~~~~~~
/usr/include/c++/13/bits/stl_algo.h: In function 'void std::__insertion_sort(_RandomAccessIterator, _RandomAccessIterator, _Compare) [with _RandomAccessIterator = __gnu_cxx::__normal_iterator<ccls::SymbolRef*, vector<ccls::SymbolRef, allocator<ccls::SymbolRef> > >; _Compare = __gnu_cxx::__ops::_Iter_comp_iter<ccls::findSymbolsAtLocation(WorkingFile*, QueryFile*, Position&, bool)::<lambda(const ccls::SymbolRef&, const ccls::SymbolRef&)> >]':
/usr/include/c++/13/bits/stl_algo.h:1812:5: note: parameter passing for argument of type '__gnu_cxx::__normal_iterator<ccls::SymbolRef*, std::vector<ccls::SymbolRef, std::allocator<ccls::SymbolRef> > >' changed in GCC 7.1
 1812 |     __insertion_sort(_RandomAccessIterator __first,
      |     ^~~~~~~~~~~~~~~~
/usr/include/c++/13/bits/stl_algo.h:1812:5: note: parameter passing for argument of type '__gnu_cxx::__normal_iterator<ccls::SymbolRef*, std::vector<ccls::SymbolRef, std::allocator<ccls::SymbolRef> > >' changed in GCC 7.1
In file included from /usr/include/c++/13/bits/stl_algo.h:61:
/usr/include/c++/13/bits/stl_heap.h: In function 'void std::__adjust_heap(_RandomAccessIterator, _Distance, _Distance, _Tp, _Compare) [with _RandomAccessIterator = __gnu_cxx::__normal_iterator<ccls::SymbolRef*, vector<ccls::SymbolRef, allocator<ccls::SymbolRef> > >; _Distance = int; _Tp = ccls::SymbolRef; _Compare = __gnu_cxx::__ops::_Iter_comp_iter<ccls::findSymbolsAtLocation(WorkingFile*, QueryFile*, Position&, bool)::<lambda(const ccls::SymbolRef&, const ccls::SymbolRef&)> >]':
/usr/include/c++/13/bits/stl_heap.h:224:5: note: parameter passing for argument of type '__gnu_cxx::__normal_iterator<ccls::SymbolRef*, std::vector<ccls::SymbolRef, std::allocator<ccls::SymbolRef> > >' changed in GCC 7.1
  224 |     __adjust_heap(_RandomAccessIterator __first, _Distance __holeIndex,
      |     ^~~~~~~~~~~~~
/usr/include/c++/13/bits/vector.tcc: In member function 'void std::vector<_Tp, _Alloc>::_M_realloc_insert(iterator, _Args&& ...) [with _Args = {long long unsigned int&, ccls::FuncDef<ccls::Vec>}; _Tp = std::pair<long long unsigned int, ccls::FuncDef<ccls::Vec> >; _Alloc = std::allocator<std::pair<long long unsigned int, ccls::FuncDef<ccls::Vec> > >]':
/usr/include/c++/13/bits/vector.tcc:445:7: note: parameter passing for argument of type 'std::vector<std::pair<long long unsigned int, ccls::FuncDef<ccls::Vec> > >::iterator' changed in GCC 7.1
  445 |       vector<_Tp, _Alloc>::
      |       ^~~~~~~~~~~~~~~~~~~
/usr/include/c++/13/bits/vector.tcc: In member function 'void std::vector<_Tp, _Alloc>::_M_realloc_insert(iterator, _Args&& ...) [with _Args = {const long long unsigned int&, ccls::FuncDef<ccls::Vec>}; _Tp = std::pair<long long unsigned int, ccls::FuncDef<ccls::Vec> >; _Alloc = std::allocator<std::pair<long long unsigned int, ccls::FuncDef<ccls::Vec> > >]':
/usr/include/c++/13/bits/vector.tcc:445:7: note: parameter passing for argument of type 'std::vector<std::pair<long long unsigned int, ccls::FuncDef<ccls::Vec> > >::iterator' changed in GCC 7.1
/usr/include/c++/13/bits/vector.tcc: In member function 'void std::vector<_Tp, _Alloc>::_M_realloc_insert(iterator, _Args&& ...) [with _Args = {long long unsigned int&, ccls::TypeDef<ccls::Vec>}; _Tp = std::pair<long long unsigned int, ccls::TypeDef<ccls::Vec> >; _Alloc = std::allocator<std::pair<long long unsigned int, ccls::TypeDef<ccls::Vec> > >]':
/usr/include/c++/13/bits/vector.tcc:445:7: note: parameter passing for argument of type 'std::vector<std::pair<long long unsigned int, ccls::TypeDef<ccls::Vec> > >::iterator' changed in GCC 7.1
/usr/include/c++/13/bits/vector.tcc: In member function 'void std::vector<_Tp, _Alloc>::_M_realloc_insert(iterator, _Args&& ...) [with _Args = {const long long unsigned int&, ccls::TypeDef<ccls::Vec>}; _Tp = std::pair<long long unsigned int, ccls::TypeDef<ccls::Vec> >; _Alloc = std::allocator<std::pair<long long unsigned int, ccls::TypeDef<ccls::Vec> > >]':
/usr/include/c++/13/bits/vector.tcc:445:7: note: parameter passing for argument of type 'std::vector<std::pair<long long unsigned int, ccls::TypeDef<ccls::Vec> > >::iterator' changed in GCC 7.1
/usr/include/c++/13/bits/vector.tcc: In member function 'void std::vector<_Tp, _Alloc>::_M_realloc_insert(iterator, _Args&& ...) [with _Args = {long long unsigned int&, ccls::VarDef&}; _Tp = std::pair<long long unsigned int, ccls::VarDef>; _Alloc = std::allocator<std::pair<long long unsigned int, ccls::VarDef> >]':
/usr/include/c++/13/bits/vector.tcc:445:7: note: parameter passing for argument of type 'std::vector<std::pair<long long unsigned int, ccls::VarDef> >::iterator' changed in GCC 7.1
/usr/include/c++/13/bits/vector.tcc: In member function 'void std::vector<_Tp, _Alloc>::_M_realloc_insert(iterator, _Args&& ...) [with _Args = {const long long unsigned int&, ccls::VarDef&}; _Tp = std::pair<long long unsigned int, ccls::VarDef>; _Alloc = std::allocator<std::pair<long long unsigned int, ccls::VarDef> >]':
/usr/include/c++/13/bits/vector.tcc:445:7: note: parameter passing for argument of type 'std::vector<std::pair<long long unsigned int, ccls::VarDef> >::iterator' changed in GCC 7.1
/usr/include/c++/13/bits/vector.tcc: In member function 'void std::vector<_Tp, _Alloc>::_M_realloc_insert(iterator, _Args&& ...) [with _Args = {const ccls::SymbolRef&}; _Tp = ccls::SymbolRef; _Alloc = std::allocator<ccls::SymbolRef>]':
/usr/include/c++/13/bits/vector.tcc:445:7: note: parameter passing for argument of type 'std::vector<ccls::SymbolRef, std::allocator<ccls::SymbolRef> >::iterator' changed in GCC 7.1
/usr/include/c++/13/bits/vector.tcc: In member function 'void std::vector<_Tp, _Alloc>::_M_realloc_insert(iterator, _Args&& ...) [with _Args = {ccls::SymbolRef}; _Tp = ccls::SymbolRef; _Alloc = std::allocator<ccls::SymbolRef>]':
/usr/include/c++/13/bits/vector.tcc:445:7: note: parameter passing for argument of type 'std::vector<ccls::SymbolRef, std::allocator<ccls::SymbolRef> >::iterator' changed in GCC 7.1
In constructor 'ccls::SymbolInformation::SymbolInformation(ccls::SymbolInformation&&)',
    inlined from 'constexpr std::_Optional_payload_base<_Tp>::_Storage<_Up, false>::_Storage(std::in_place_t, _Args&& ...) [with _Args = {ccls::SymbolInformation}; _Up = ccls::SymbolInformation; _Tp = ccls::SymbolInformation]' at /usr/include/c++/13/optional:244:8,
    inlined from 'constexpr std::_Optional_payload_base<_Tp>::_Optional_payload_base(std::in_place_t, _Args&& ...) [with _Args = {ccls::SymbolInformation}; _Tp = ccls::SymbolInformation]' at /usr/include/c++/13/optional:126:4,
    inlined from 'constexpr std::_Optional_payload<ccls::SymbolInformation, true, false, false>::_Optional_payload(std::in_place_t, _Args&& ...) [with _Args = {ccls::SymbolInformation}][inherited from std::_Optional_payload_base<ccls::SymbolInformation>]' at /usr/include/c++/13/optional:399:42,
    inlined from 'constexpr std::_Optional_payload<ccls::SymbolInformation, false, false, false>::_Optional_payload(std::in_place_t, _Args&& ...) [with _Args = {ccls::SymbolInformation}][inherited from std::_Optional_payload_base<ccls::SymbolInformation>]' at /usr/include/c++/13/optional:433:57,
    inlined from 'constexpr std::_Optional_base<_Tp, <anonymous>, <anonymous> >::_Optional_base(std::in_place_t, _Args&& ...) [with _Args = {ccls::SymbolInformation}; typename std::enable_if<is_constructible_v<_Tp, _Args ...>, bool>::type <anonymous> = false; _Tp = ccls::SymbolInformation; bool <anonymous> = false; bool <anonymous> = false]' at /usr/include/c++/13/optional:523:4,
    inlined from 'constexpr std::optional<_Tp>::optional(_Up&&) [with _Up = ccls::SymbolInformation; typename std::enable_if<__and_v<std::__not_<std::is_same<std::optional<_Tp>, typename std::remove_cv<typename std::remove_reference<_Up>::type>::type> >, std::__not_<std::is_same<std::in_place_t, typename std::remove_cv<typename std::remove_reference<_Up>::type>::type> >, std::is_constructible<_Tp, _Up>, std::is_convertible<_Up, _Tp> >, bool>::type <anonymous> = true; _Tp = ccls::SymbolInformation]' at /usr/include/c++/13/optional:751:47,
    inlined from 'std::optional<ccls::SymbolInformation> ccls::getSymbolInfo(DB*, SymbolIdx, bool)' at /<<PKGBUILDDIR>>/src/query.cc:779:12:
/<<PKGBUILDDIR>>/src/lsp.hh:179:8: warning: 'info.ccls::SymbolInformation::kind' may be used uninitialized [-Wmaybe-uninitialized]
  179 | struct SymbolInformation {
      |        ^~~~~~~~~~~~~~~~~
/<<PKGBUILDDIR>>/src/query.cc: In function 'std::optional<ccls::SymbolInformation> ccls::getSymbolInfo(DB*, SymbolIdx, bool)':
/<<PKGBUILDDIR>>/src/query.cc:770:23: note: 'info' declared here
  770 |     SymbolInformation info;
      |                       ^~~~
In member function 'std::vector<_Tp, _Alloc>::reference std::vector<_Tp, _Alloc>::emplace_back(_Args&& ...) [with _Args = {long long unsigned int&, ccls::FuncDef<ccls::Vec>}; _Tp = std::pair<long long unsigned int, ccls::FuncDef<ccls::Vec> >; _Alloc = std::allocator<std::pair<long long unsigned int, ccls::FuncDef<ccls::Vec> > >]',
    inlined from 'static ccls::IndexUpdate ccls::IndexUpdate::createDelta(ccls::IndexFile*, ccls::IndexFile*)' at /<<PKGBUILDDIR>>/src/query.cc:132:35:
/usr/include/c++/13/bits/vector.tcc:123:28: note: parameter passing for argument of type '__gnu_cxx::__normal_iterator<std::pair<long long unsigned int, ccls::FuncDef<ccls::Vec> >*, std::vector<std::pair<long long unsigned int, ccls::FuncDef<ccls::Vec> > > >' changed in GCC 7.1
  123 |           _M_realloc_insert(end(), std::forward<_Args>(__args)...);
      |           ~~~~~~~~~~~~~~~~~^~~~~~~~~~~~~~~~~~~~~~~~~~~~~~~~~~~~~~~
In member function 'std::vector<_Tp, _Alloc>::reference std::vector<_Tp, _Alloc>::emplace_back(_Args&& ...) [with _Args = {const long long unsigned int&, ccls::FuncDef<ccls::Vec>}; _Tp = std::pair<long long unsigned int, ccls::FuncDef<ccls::Vec> >; _Alloc = std::allocator<std::pair<long long unsigned int, ccls::FuncDef<ccls::Vec> > >]',
    inlined from 'static ccls::IndexUpdate ccls::IndexUpdate::createDelta(ccls::IndexFile*, ccls::IndexFile*)' at /<<PKGBUILDDIR>>/src/query.cc:140:38:
/usr/include/c++/13/bits/vector.tcc:123:28: note: parameter passing for argument of type '__gnu_cxx::__normal_iterator<std::pair<long long unsigned int, ccls::FuncDef<ccls::Vec> >*, std::vector<std::pair<long long unsigned int, ccls::FuncDef<ccls::Vec> > > >' changed in GCC 7.1
  123 |           _M_realloc_insert(end(), std::forward<_Args>(__args)...);
      |           ~~~~~~~~~~~~~~~~~^~~~~~~~~~~~~~~~~~~~~~~~~~~~~~~~~~~~~~~
In member function 'std::vector<_Tp, _Alloc>::reference std::vector<_Tp, _Alloc>::emplace_back(_Args&& ...) [with _Args = {long long unsigned int&, ccls::TypeDef<ccls::Vec>}; _Tp = std::pair<long long unsigned int, ccls::TypeDef<ccls::Vec> >; _Alloc = std::allocator<std::pair<long long unsigned int, ccls::TypeDef<ccls::Vec> > >]',
    inlined from 'static ccls::IndexUpdate ccls::IndexUpdate::createDelta(ccls::IndexFile*, ccls::IndexFile*)' at /<<PKGBUILDDIR>>/src/query.cc:150:35:
/usr/include/c++/13/bits/vector.tcc:123:28: note: parameter passing for argument of type '__gnu_cxx::__normal_iterator<std::pair<long long unsigned int, ccls::TypeDef<ccls::Vec> >*, std::vector<std::pair<long long unsigned int, ccls::TypeDef<ccls::Vec> > > >' changed in GCC 7.1
  123 |           _M_realloc_insert(end(), std::forward<_Args>(__args)...);
      |           ~~~~~~~~~~~~~~~~~^~~~~~~~~~~~~~~~~~~~~~~~~~~~~~~~~~~~~~~
In member function 'std::vector<_Tp, _Alloc>::reference std::vector<_Tp, _Alloc>::emplace_back(_Args&& ...) [with _Args = {const long long unsigned int&, ccls::TypeDef<ccls::Vec>}; _Tp = std::pair<long long unsigned int, ccls::TypeDef<ccls::Vec> >; _Alloc = std::allocator<std::pair<long long unsigned int, ccls::TypeDef<ccls::Vec> > >]',
    inlined from 'static ccls::IndexUpdate ccls::IndexUpdate::createDelta(ccls::IndexFile*, ccls::IndexFile*)' at /<<PKGBUILDDIR>>/src/query.cc:159:38:
/usr/include/c++/13/bits/vector.tcc:123:28: note: parameter passing for argument of type '__gnu_cxx::__normal_iterator<std::pair<long long unsigned int, ccls::TypeDef<ccls::Vec> >*, std::vector<std::pair<long long unsigned int, ccls::TypeDef<ccls::Vec> > > >' changed in GCC 7.1
  123 |           _M_realloc_insert(end(), std::forward<_Args>(__args)...);
      |           ~~~~~~~~~~~~~~~~~^~~~~~~~~~~~~~~~~~~~~~~~~~~~~~~~~~~~~~~
In member function 'std::vector<_Tp, _Alloc>::reference std::vector<_Tp, _Alloc>::emplace_back(_Args&& ...) [with _Args = {long long unsigned int&, ccls::VarDef&}; _Tp = std::pair<long long unsigned int, ccls::VarDef>; _Alloc = std::allocator<std::pair<long long unsigned int, ccls::VarDef> >]',
    inlined from 'static ccls::IndexUpdate ccls::IndexUpdate::createDelta(ccls::IndexFile*, ccls::IndexFile*)' at /<<PKGBUILDDIR>>/src/query.cc:170:34:
/usr/include/c++/13/bits/vector.tcc:123:28: note: parameter passing for argument of type '__gnu_cxx::__normal_iterator<std::pair<long long unsigned int, ccls::VarDef>*, std::vector<std::pair<long long unsigned int, ccls::VarDef> > >' changed in GCC 7.1
  123 |           _M_realloc_insert(end(), std::forward<_Args>(__args)...);
      |           ~~~~~~~~~~~~~~~~~^~~~~~~~~~~~~~~~~~~~~~~~~~~~~~~~~~~~~~~
In member function 'std::vector<_Tp, _Alloc>::reference std::vector<_Tp, _Alloc>::emplace_back(_Args&& ...) [with _Args = {const long long unsigned int&, ccls::VarDef&}; _Tp = std::pair<long long unsigned int, ccls::VarDef>; _Alloc = std::allocator<std::pair<long long unsigned int, ccls::VarDef> >]',
    inlined from 'static ccls::IndexUpdate ccls::IndexUpdate::createDelta(ccls::IndexFile*, ccls::IndexFile*)' at /<<PKGBUILDDIR>>/src/query.cc:177:37:
/usr/include/c++/13/bits/vector.tcc:123:28: note: parameter passing for argument of type '__gnu_cxx::__normal_iterator<std::pair<long long unsigned int, ccls::VarDef>*, std::vector<std::pair<long long unsigned int, ccls::VarDef> > >' changed in GCC 7.1
  123 |           _M_realloc_insert(end(), std::forward<_Args>(__args)...);
      |           ~~~~~~~~~~~~~~~~~^~~~~~~~~~~~~~~~~~~~~~~~~~~~~~~~~~~~~~~
In member function 'std::vector<_Tp, _Alloc>::reference std::vector<_Tp, _Alloc>::emplace_back(_Args&& ...) [with _Args = {long long unsigned int, int&}; _Tp = std::pair<long long unsigned int, long long int>; _Alloc = std::allocator<std::pair<long long unsigned int, long long int> >]',
    inlined from 'void ccls::{anonymous}::IndexDataConsumer::collectRecordMembers(ccls::IndexType&, const clang::RecordDecl*)' at /<<PKGBUILDDIR>>/src/indexer.cc:679:37:
/usr/include/c++/13/bits/vector.tcc:123:28: note: parameter passing for argument of type '__gnu_cxx::__normal_iterator<std::pair<long long unsigned int, long long int>*, std::vector<std::pair<long long unsigned int, long long int>, std::allocator<std::pair<long long unsigned int, long long int> > > >' changed in GCC 7.1
  123 |           _M_realloc_insert(end(), std::forward<_Args>(__args)...);
      |           ~~~~~~~~~~~~~~~~~^~~~~~~~~~~~~~~~~~~~~~~~~~~~~~~~~~~~~~~
In member function 'void std::vector<_Tp, _Alloc>::push_back(const value_type&) [with _Tp = long long unsigned int; _Alloc = std::allocator<long long unsigned int>]',
    inlined from 'virtual bool ccls::{anonymous}::IndexDataConsumer::handleDeclOccurrence(const clang::Decl*, clang::index::SymbolRoleSet, llvm::ArrayRef<clang::index::SymbolRelation>, clang::SourceLocation, clang::index::IndexDataConsumer::ASTNodeInfo)' at /<<PKGBUILDDIR>>/src/indexer.cc:828:53:
/usr/include/c++/13/bits/stl_vector.h:1289:28: note: parameter passing for argument of type '__gnu_cxx::__normal_iterator<long long unsigned int*, std::vector<long long unsigned int, std::allocator<long long unsigned int> > >' changed in GCC 7.1
 1289 |           _M_realloc_insert(end(), __x);
      |           ~~~~~~~~~~~~~~~~~^~~~~~~~~~~~
In member function 'std::vector<_Tp, _Alloc>::reference std::vector<_Tp, _Alloc>::emplace_back(_Args&& ...) [with _Args = {ccls::SymbolRef}; _Tp = ccls::SymbolRef; _Alloc = std::allocator<ccls::SymbolRef>]',
    inlined from 'void std::vector<_Tp, _Alloc>::push_back(value_type&&) [with _Tp = ccls::SymbolRef; _Alloc = std::allocator<ccls::SymbolRef>]' at /usr/include/c++/13/bits/stl_vector.h:1296:21,
    inlined from 'virtual bool ccls::{anonymous}::IndexDataConsumer::handleDeclOccurrence(const clang::Decl*, clang::index::SymbolRoleSet, llvm::ArrayRef<clang::index::SymbolRelation>, clang::SourceLocation, clang::index::IndexDataConsumer::ASTNodeInfo)' at /<<PKGBUILDDIR>>/src/indexer.cc:833:37:
/usr/include/c++/13/bits/vector.tcc:123:28: note: parameter passing for argument of type '__gnu_cxx::__normal_iterator<ccls::SymbolRef*, std::vector<ccls::SymbolRef, std::allocator<ccls::SymbolRef> > >' changed in GCC 7.1
  123 |           _M_realloc_insert(end(), std::forward<_Args>(__args)...);
      |           ~~~~~~~~~~~~~~~~~^~~~~~~~~~~~~~~~~~~~~~~~~~~~~~~~~~~~~~~
In member function 'void std::vector<_Tp, _Alloc>::push_back(const value_type&) [with _Tp = long long unsigned int; _Alloc = std::allocator<long long unsigned int>]',
    inlined from 'virtual bool ccls::{anonymous}::IndexDataConsumer::handleDeclOccurrence(const clang::Decl*, clang::index::SymbolRoleSet, llvm::ArrayRef<clang::index::SymbolRelation>, clang::SourceLocation, clang::index::IndexDataConsumer::ASTNodeInfo)' at /<<PKGBUILDDIR>>/src/indexer.cc:853:53:
/usr/include/c++/13/bits/stl_vector.h:1289:28: note: parameter passing for argument of type '__gnu_cxx::__normal_iterator<long long unsigned int*, std::vector<long long unsigned int, std::allocator<long long unsigned int> > >' changed in GCC 7.1
 1289 |           _M_realloc_insert(end(), __x);
      |           ~~~~~~~~~~~~~~~~~^~~~~~~~~~~~
In member function 'void std::vector<_Tp, _Alloc>::push_back(const value_type&) [with _Tp = long long unsigned int; _Alloc = std::allocator<long long unsigned int>]',
    inlined from 'virtual bool ccls::{anonymous}::IndexDataConsumer::handleDeclOccurrence(const clang::Decl*, clang::index::SymbolRoleSet, llvm::ArrayRef<clang::index::SymbolRelation>, clang::SourceLocation, clang::index::IndexDataConsumer::ASTNodeInfo)' at /<<PKGBUILDDIR>>/src/indexer.cc:871:52:
/usr/include/c++/13/bits/stl_vector.h:1289:28: note: parameter passing for argument of type '__gnu_cxx::__normal_iterator<long long unsigned int*, std::vector<long long unsigned int, std::allocator<long long unsigned int> > >' changed in GCC 7.1
 1289 |           _M_realloc_insert(end(), __x);
      |           ~~~~~~~~~~~~~~~~~^~~~~~~~~~~~
In member function 'std::vector<_Tp, _Alloc>::reference std::vector<_Tp, _Alloc>::emplace_back(_Args&& ...) [with _Args = {long long unsigned int&, int}; _Tp = std::pair<long long unsigned int, long long int>; _Alloc = std::allocator<std::pair<long long unsigned int, long long int> >]',
    inlined from 'virtual bool ccls::{anonymous}::IndexDataConsumer::handleDeclOccurrence(const clang::Decl*, clang::index::SymbolRoleSet, llvm::ArrayRef<clang::index::SymbolRelation>, clang::SourceLocation, clang::index::IndexDataConsumer::ASTNodeInfo)' at /<<PKGBUILDDIR>>/src/indexer.cc:873:55:
/usr/include/c++/13/bits/vector.tcc:123:28: note: parameter passing for argument of type '__gnu_cxx::__normal_iterator<std::pair<long long unsigned int, long long int>*, std::vector<std::pair<long long unsigned int, long long int>, std::allocator<std::pair<long long unsigned int, long long int> > > >' changed in GCC 7.1
  123 |           _M_realloc_insert(end(), std::forward<_Args>(__args)...);
      |           ~~~~~~~~~~~~~~~~~^~~~~~~~~~~~~~~~~~~~~~~~~~~~~~~~~~~~~~~
In member function 'void std::vector<_Tp, _Alloc>::push_back(const value_type&) [with _Tp = long long unsigned int; _Alloc = std::allocator<long long unsigned int>]',
    inlined from 'virtual bool ccls::{anonymous}::IndexDataConsumer::handleDeclOccurrence(const clang::Decl*, clang::index::SymbolRoleSet, llvm::ArrayRef<clang::index::SymbolRelation>, clang::SourceLocation, clang::index::IndexDataConsumer::ASTNodeInfo)' at /<<PKGBUILDDIR>>/src/indexer.cc:879:51:
/usr/include/c++/13/bits/stl_vector.h:1289:28: note: parameter passing for argument of type '__gnu_cxx::__normal_iterator<long long unsigned int*, std::vector<long long unsigned int, std::allocator<long long unsigned int> > >' changed in GCC 7.1
 1289 |           _M_realloc_insert(end(), __x);
      |           ~~~~~~~~~~~~~~~~~^~~~~~~~~~~~
In member function 'void std::vector<_Tp, _Alloc>::push_back(const value_type&) [with _Tp = long long unsigned int; _Alloc = std::allocator<long long unsigned int>]',
    inlined from 'virtual bool ccls::{anonymous}::IndexDataConsumer::handleDeclOccurrence(const clang::Decl*, clang::index::SymbolRoleSet, llvm::ArrayRef<clang::index::SymbolRelation>, clang::SourceLocation, clang::index::IndexDataConsumer::ASTNodeInfo)' at /<<PKGBUILDDIR>>/src/indexer.cc:955:40:
/usr/include/c++/13/bits/stl_vector.h:1289:28: note: parameter passing for argument of type '__gnu_cxx::__normal_iterator<long long unsigned int*, std::vector<long long unsigned int, std::allocator<long long unsigned int> > >' changed in GCC 7.1
 1289 |           _M_realloc_insert(end(), __x);
      |           ~~~~~~~~~~~~~~~~~^~~~~~~~~~~~
In member function 'void std::vector<_Tp, _Alloc>::push_back(const value_type&) [with _Tp = long long unsigned int; _Alloc = std::allocator<long long unsigned int>]',
    inlined from 'virtual bool ccls::{anonymous}::IndexDataConsumer::handleDeclOccurrence(const clang::Decl*, clang::index::SymbolRoleSet, llvm::ArrayRef<clang::index::SymbolRelation>, clang::SourceLocation, clang::index::IndexDataConsumer::ASTNodeInfo)' at /<<PKGBUILDDIR>>/src/indexer.cc:956:49:
/usr/include/c++/13/bits/stl_vector.h:1289:28: note: parameter passing for argument of type '__gnu_cxx::__normal_iterator<long long unsigned int*, std::vector<long long unsigned int, std::allocator<long long unsigned int> > >' changed in GCC 7.1
 1289 |           _M_realloc_insert(end(), __x);
      |           ~~~~~~~~~~~~~~~~~^~~~~~~~~~~~
In member function 'void std::vector<_Tp, _Alloc>::push_back(const value_type&) [with _Tp = long long unsigned int; _Alloc = std::allocator<long long unsigned int>]',
    inlined from 'virtual bool ccls::{anonymous}::IndexDataConsumer::handleDeclOccurrence(const clang::Decl*, clang::index::SymbolRoleSet, llvm::ArrayRef<clang::index::SymbolRelation>, clang::SourceLocation, clang::index::IndexDataConsumer::ASTNodeInfo)' at /<<PKGBUILDDIR>>/src/indexer.cc:1021:38:
/usr/include/c++/13/bits/stl_vector.h:1289:28: note: parameter passing for argument of type '__gnu_cxx::__normal_iterator<long long unsigned int*, std::vector<long long unsigned int, std::allocator<long long unsigned int> > >' changed in GCC 7.1
 1289 |           _M_realloc_insert(end(), __x);
      |           ~~~~~~~~~~~~~~~~~^~~~~~~~~~~~
In member function 'void std::vector<_Tp, _Alloc>::push_back(const value_type&) [with _Tp = long long unsigned int; _Alloc = std::allocator<long long unsigned int>]',
    inlined from 'virtual bool ccls::{anonymous}::IndexDataConsumer::handleDeclOccurrence(const clang::Decl*, clang::index::SymbolRoleSet, llvm::ArrayRef<clang::index::SymbolRelation>, clang::SourceLocation, clang::index::IndexDataConsumer::ASTNodeInfo)' at /<<PKGBUILDDIR>>/src/indexer.cc:1022:47:
/usr/include/c++/13/bits/stl_vector.h:1289:28: note: parameter passing for argument of type '__gnu_cxx::__normal_iterator<long long unsigned int*, std::vector<long long unsigned int, std::allocator<long long unsigned int> > >' changed in GCC 7.1
 1289 |           _M_realloc_insert(end(), __x);
      |           ~~~~~~~~~~~~~~~~~^~~~~~~~~~~~
In member function 'void std::vector<_Tp, _Alloc>::push_back(const value_type&) [with _Tp = long long unsigned int; _Alloc = std::allocator<long long unsigned int>]',
    inlined from 'virtual bool ccls::{anonymous}::IndexDataConsumer::handleDeclOccurrence(const clang::Decl*, clang::index::SymbolRoleSet, llvm::ArrayRef<clang::index::SymbolRelation>, clang::SourceLocation, clang::index::IndexDataConsumer::ASTNodeInfo)' at /<<PKGBUILDDIR>>/src/indexer.cc:1055:38:
/usr/include/c++/13/bits/stl_vector.h:1289:28: note: parameter passing for argument of type '__gnu_cxx::__normal_iterator<long long unsigned int*, std::vector<long long unsigned int, std::allocator<long long unsigned int> > >' changed in GCC 7.1
 1289 |           _M_realloc_insert(end(), __x);
      |           ~~~~~~~~~~~~~~~~~^~~~~~~~~~~~
In member function 'void std::vector<_Tp, _Alloc>::push_back(const value_type&) [with _Tp = long long unsigned int; _Alloc = std::allocator<long long unsigned int>]',
    inlined from 'virtual bool ccls::{anonymous}::IndexDataConsumer::handleDeclOccurrence(const clang::Decl*, clang::index::SymbolRoleSet, llvm::ArrayRef<clang::index::SymbolRelation>, clang::SourceLocation, clang::index::IndexDataConsumer::ASTNodeInfo)' at /<<PKGBUILDDIR>>/src/indexer.cc:1056:47:
/usr/include/c++/13/bits/stl_vector.h:1289:28: note: parameter passing for argument of type '__gnu_cxx::__normal_iterator<long long unsigned int*, std::vector<long long unsigned int, std::allocator<long long unsigned int> > >' changed in GCC 7.1
 1289 |           _M_realloc_insert(end(), __x);
      |           ~~~~~~~~~~~~~~~~~^~~~~~~~~~~~
/usr/include/c++/13/bits/stl_algo.h: In function 'void std::__introsort_loop(_RandomAccessIterator, _RandomAccessIterator, _Size, _Compare) [with _RandomAccessIterator = __gnu_cxx::__normal_iterator<ccls::SymbolRef*, vector<ccls::SymbolRef, allocator<ccls::SymbolRef> > >; _Size = int; _Compare = __gnu_cxx::__ops::_Iter_comp_iter<ccls::findSymbolsAtLocation(WorkingFile*, QueryFile*, Position&, bool)::<lambda(const ccls::SymbolRef&, const ccls::SymbolRef&)> >]':
/usr/include/c++/13/bits/stl_algo.h:1918:5: note: parameter passing for argument of type '__gnu_cxx::__normal_iterator<ccls::SymbolRef*, std::vector<ccls::SymbolRef, std::allocator<ccls::SymbolRef> > >' changed in GCC 7.1
 1918 |     __introsort_loop(_RandomAccessIterator __first,
      |     ^~~~~~~~~~~~~~~~
/usr/include/c++/13/bits/stl_algo.h:1918:5: note: parameter passing for argument of type '__gnu_cxx::__normal_iterator<ccls::SymbolRef*, std::vector<ccls::SymbolRef, std::allocator<ccls::SymbolRef> > >' changed in GCC 7.1
/usr/include/c++/13/bits/stl_algo.h:1932:32: note: parameter passing for argument of type '__gnu_cxx::__normal_iterator<ccls::SymbolRef*, std::vector<ccls::SymbolRef, std::allocator<ccls::SymbolRef> > >' changed in GCC 7.1
 1932 |           std::__introsort_loop(__cut, __last, __depth_limit, __comp);
      |           ~~~~~~~~~~~~~~~~~~~~~^~~~~~~~~~~~~~~~~~~~~~~~~~~~~~~~~~~~~~
In file included from /usr/include/c++/13/vector:66:
In member function 'void std::vector<_Tp, _Alloc>::push_back(const value_type&) [with _Tp = ccls::SymbolRef; _Alloc = std::allocator<ccls::SymbolRef>]',
    inlined from 'std::vector<ccls::SymbolRef, std::allocator<ccls::SymbolRef> > ccls::findSymbolsAtLocation(WorkingFile*, QueryFile*, Position&, bool)' at /<<PKGBUILDDIR>>/src/query.cc:803:24:
/usr/include/c++/13/bits/stl_vector.h:1289:28: note: parameter passing for argument of type '__gnu_cxx::__normal_iterator<ccls::SymbolRef*, std::vector<ccls::SymbolRef, std::allocator<ccls::SymbolRef> > >' changed in GCC 7.1
 1289 |           _M_realloc_insert(end(), __x);
      |           ~~~~~~~~~~~~~~~~~^~~~~~~~~~~~
In function 'void std::__sort(_RandomAccessIterator, _RandomAccessIterator, _Compare) [with _RandomAccessIterator = __gnu_cxx::__normal_iterator<ccls::SymbolRef*, vector<ccls::SymbolRef, allocator<ccls::SymbolRef> > >; _Compare = __gnu_cxx::__ops::_Iter_comp_iter<ccls::findSymbolsAtLocation(WorkingFile*, QueryFile*, Position&, bool)::<lambda(const ccls::SymbolRef&, const ccls::SymbolRef&)> >]',
    inlined from 'void std::sort(_RAIter, _RAIter, _Compare) [with _RAIter = __gnu_cxx::__normal_iterator<ccls::SymbolRef*, vector<ccls::SymbolRef, allocator<ccls::SymbolRef> > >; _Compare = ccls::findSymbolsAtLocation(WorkingFile*, QueryFile*, Position&, bool)::<lambda(const ccls::SymbolRef&, const ccls::SymbolRef&)>]' at /usr/include/c++/13/bits/stl_algo.h:4894:18,
    inlined from 'std::vector<ccls::SymbolRef, std::allocator<ccls::SymbolRef> > ccls::findSymbolsAtLocation(WorkingFile*, QueryFile*, Position&, bool)' at /<<PKGBUILDDIR>>/src/query.cc:816:12:
/usr/include/c++/13/bits/stl_algo.h:1947:32: note: parameter passing for argument of type '__gnu_cxx::__normal_iterator<ccls::SymbolRef*, std::vector<ccls::SymbolRef, std::allocator<ccls::SymbolRef> > >' changed in GCC 7.1
 1947 |           std::__introsort_loop(__first, __last,
      |           ~~~~~~~~~~~~~~~~~~~~~^~~~~~~~~~~~~~~~~
 1948 |                                 std::__lg(__last - __first) * 2,
      |                                 ~~~~~~~~~~~~~~~~~~~~~~~~~~~~~~~~
 1949 |                                 __comp);
      |                                 ~~~~~~~
In function 'void std::__final_insertion_sort(_RandomAccessIterator, _RandomAccessIterator, _Compare) [with _RandomAccessIterator = __gnu_cxx::__normal_iterator<ccls::SymbolRef*, vector<ccls::SymbolRef, allocator<ccls::SymbolRef> > >; _Compare = __gnu_cxx::__ops::_Iter_comp_iter<ccls::findSymbolsAtLocation(WorkingFile*, QueryFile*, Position&, bool)::<lambda(const ccls::SymbolRef&, const ccls::SymbolRef&)> >]',
    inlined from 'void std::__sort(_RandomAccessIterator, _RandomAccessIterator, _Compare) [with _RandomAccessIterator = __gnu_cxx::__normal_iterator<ccls::SymbolRef*, vector<ccls::SymbolRef, allocator<ccls::SymbolRef> > >; _Compare = __gnu_cxx::__ops::_Iter_comp_iter<ccls::findSymbolsAtLocation(WorkingFile*, QueryFile*, Position&, bool)::<lambda(const ccls::SymbolRef&, const ccls::SymbolRef&)> >]' at /usr/include/c++/13/bits/stl_algo.h:1950:31,
    inlined from 'void std::sort(_RAIter, _RAIter, _Compare) [with _RAIter = __gnu_cxx::__normal_iterator<ccls::SymbolRef*, vector<ccls::SymbolRef, allocator<ccls::SymbolRef> > >; _Compare = ccls::findSymbolsAtLocation(WorkingFile*, QueryFile*, Position&, bool)::<lambda(const ccls::SymbolRef&, const ccls::SymbolRef&)>]' at /usr/include/c++/13/bits/stl_algo.h:4894:18,
    inlined from 'std::vector<ccls::SymbolRef, std::allocator<ccls::SymbolRef> > ccls::findSymbolsAtLocation(WorkingFile*, QueryFile*, Position&, bool)' at /<<PKGBUILDDIR>>/src/query.cc:816:12:
/usr/include/c++/13/bits/stl_algo.h:1859:32: note: parameter passing for argument of type '__gnu_cxx::__normal_iterator<ccls::SymbolRef*, std::vector<ccls::SymbolRef, std::allocator<ccls::SymbolRef> > >' changed in GCC 7.1
 1859 |           std::__insertion_sort(__first, __first + int(_S_threshold), __comp);
      |           ~~~~~~~~~~~~~~~~~~~~~^~~~~~~~~~~~~~~~~~~~~~~~~~~~~~~~~~~~~~~~~~~~~~
/usr/include/c++/13/bits/stl_algo.h:1864:30: note: parameter passing for argument of type '__gnu_cxx::__normal_iterator<ccls::SymbolRef*, std::vector<ccls::SymbolRef, std::allocator<ccls::SymbolRef> > >' changed in GCC 7.1
 1864 |         std::__insertion_sort(__first, __last, __comp);
      |         ~~~~~~~~~~~~~~~~~~~~~^~~~~~~~~~~~~~~~~~~~~~~~~
In member function 'std::vector<_Tp, _Alloc>::iterator std::vector<_Tp, _Alloc>::insert(const_iterator, _InputIterator, _InputIterator) [with _InputIterator = __gnu_cxx::__normal_iterator<const long long unsigned int*, std::vector<long long unsigned int, std::allocator<long long unsigned int> > >; <template-parameter-2-2> = void; _Tp = long long unsigned int; _Alloc = std::allocator<long long unsigned int>]',
    inlined from 'void ccls::{anonymous}::addRange(std::vector<T>&, const std::vector<T>&) [with T = long long unsigned int]' at /<<PKGBUILDDIR>>/src/query.cc:34:14,
    inlined from 'void ccls::DB::applyIndexUpdate(ccls::IndexUpdate*)' at /<<PKGBUILDDIR>>/src/query.cc:357:3:
/usr/include/c++/13/bits/stl_vector.h:1483:26: note: parameter passing for argument of type '__gnu_cxx::__normal_iterator<long long unsigned int*, std::vector<long long unsigned int, std::allocator<long long unsigned int> > >' changed in GCC 7.1
 1483 |           _M_range_insert(begin() + __offset, __first, __last,
      |           ~~~~~~~~~~~~~~~^~~~~~~~~~~~~~~~~~~~~~~~~~~~~~~~~~~~~
 1484 |                           std::__iterator_category(__first));
      |                           ~~~~~~~~~~~~~~~~~~~~~~~~~~~~~~~~~~
/usr/include/c++/13/bits/stl_vector.h:1483:26: note: parameter passing for argument of type '__gnu_cxx::__normal_iterator<const long long unsigned int*, std::vector<long long unsigned int, std::allocator<long long unsigned int> > >' changed in GCC 7.1
In member function 'std::vector<_Tp, _Alloc>::iterator std::vector<_Tp, _Alloc>::insert(const_iterator, _InputIterator, _InputIterator) [with _InputIterator = __gnu_cxx::__normal_iterator<const long long unsigned int*, std::vector<long long unsigned int, std::allocator<long long unsigned int> > >; <template-parameter-2-2> = void; _Tp = long long unsigned int; _Alloc = std::allocator<long long unsigned int>]',
    inlined from 'void ccls::{anonymous}::addRange(std::vector<T>&, const std::vector<T>&) [with T = long long unsigned int]' at /<<PKGBUILDDIR>>/src/query.cc:34:14,
    inlined from 'void ccls::DB::applyIndexUpdate(ccls::IndexUpdate*)' at /<<PKGBUILDDIR>>/src/query.cc:378:3:
/usr/include/c++/13/bits/stl_vector.h:1483:26: note: parameter passing for argument of type '__gnu_cxx::__normal_iterator<long long unsigned int*, std::vector<long long unsigned int, std::allocator<long long unsigned int> > >' changed in GCC 7.1
 1483 |           _M_range_insert(begin() + __offset, __first, __last,
      |           ~~~~~~~~~~~~~~~^~~~~~~~~~~~~~~~~~~~~~~~~~~~~~~~~~~~~
 1484 |                           std::__iterator_category(__first));
      |                           ~~~~~~~~~~~~~~~~~~~~~~~~~~~~~~~~~~
/usr/include/c++/13/bits/stl_vector.h:1483:26: note: parameter passing for argument of type '__gnu_cxx::__normal_iterator<const long long unsigned int*, std::vector<long long unsigned int, std::allocator<long long unsigned int> > >' changed in GCC 7.1
In member function 'std::vector<_Tp, _Alloc>::iterator std::vector<_Tp, _Alloc>::insert(const_iterator, _InputIterator, _InputIterator) [with _InputIterator = __gnu_cxx::__normal_iterator<const long long unsigned int*, std::vector<long long unsigned int, std::allocator<long long unsigned int> > >; <template-parameter-2-2> = void; _Tp = long long unsigned int; _Alloc = std::allocator<long long unsigned int>]',
    inlined from 'void ccls::{anonymous}::addRange(std::vector<T>&, const std::vector<T>&) [with T = long long unsigned int]' at /<<PKGBUILDDIR>>/src/query.cc:34:14,
    inlined from 'void ccls::DB::applyIndexUpdate(ccls::IndexUpdate*)' at /<<PKGBUILDDIR>>/src/query.cc:379:3:
/usr/include/c++/13/bits/stl_vector.h:1483:26: note: parameter passing for argument of type '__gnu_cxx::__normal_iterator<long long unsigned int*, std::vector<long long unsigned int, std::allocator<long long unsigned int> > >' changed in GCC 7.1
 1483 |           _M_range_insert(begin() + __offset, __first, __last,
      |           ~~~~~~~~~~~~~~~^~~~~~~~~~~~~~~~~~~~~~~~~~~~~~~~~~~~~
 1484 |                           std::__iterator_category(__first));
      |                           ~~~~~~~~~~~~~~~~~~~~~~~~~~~~~~~~~~
/usr/include/c++/13/bits/stl_vector.h:1483:26: note: parameter passing for argument of type '__gnu_cxx::__normal_iterator<const long long unsigned int*, std::vector<long long unsigned int, std::allocator<long long unsigned int> > >' changed in GCC 7.1
In file included from /usr/include/c++/13/vector:72,
                 from /<<PKGBUILDDIR>>/src/utils.hh:13,
                 from /<<PKGBUILDDIR>>/src/serializer.hh:6,
                 from /<<PKGBUILDDIR>>/src/config.hh:6,
                 from /<<PKGBUILDDIR>>/src/lsp.hh:6,
                 from /<<PKGBUILDDIR>>/src/pipeline.hh:6,
                 from /<<PKGBUILDDIR>>/src/pipeline.cc:4:
/usr/include/c++/13/bits/vector.tcc: In member function 'void std::vector<_Tp, _Alloc>::_M_realloc_insert(iterator, _Args&& ...) [with _Args = {ccls::InMessage}; _Tp = ccls::InMessage; _Alloc = std::allocator<ccls::InMessage>]':
/usr/include/c++/13/bits/vector.tcc:445:7: note: parameter passing for argument of type 'std::vector<ccls::InMessage, std::allocator<ccls::InMessage> >::iterator' changed in GCC 7.1
  445 |       vector<_Tp, _Alloc>::
      |       ^~~~~~~~~~~~~~~~~~~
[ 41%] Building CXX object CMakeFiles/ccls.dir/src/sema_manager.cc.o
/usr/bin/c++  -I/<<PKGBUILDDIR>>/src -isystem /<<PKGBUILDDIR>>/third_party -isystem /usr/lib/llvm-16/include -g -O2 -ffile-prefix-map=/<<PKGBUILDDIR>>=. -fstack-protector-strong -fstack-clash-protection -Wformat -Werror=format-security -Wdate-time -D_FORTIFY_SOURCE=2 -std=c++17 -Wall -Wno-sign-compare -Wno-return-type -Wno-unused-result -MD -MT CMakeFiles/ccls.dir/src/sema_manager.cc.o -MF CMakeFiles/ccls.dir/src/sema_manager.cc.o.d -o CMakeFiles/ccls.dir/src/sema_manager.cc.o -c /<<PKGBUILDDIR>>/src/sema_manager.cc
[ 44%] Building CXX object CMakeFiles/ccls.dir/src/serializer.cc.o
/usr/bin/c++  -I/<<PKGBUILDDIR>>/src -isystem /<<PKGBUILDDIR>>/third_party -isystem /usr/lib/llvm-16/include -g -O2 -ffile-prefix-map=/<<PKGBUILDDIR>>=. -fstack-protector-strong -fstack-clash-protection -Wformat -Werror=format-security -Wdate-time -D_FORTIFY_SOURCE=2 -std=c++17 -Wall -Wno-sign-compare -Wno-return-type -Wno-unused-result -MD -MT CMakeFiles/ccls.dir/src/serializer.cc.o -MF CMakeFiles/ccls.dir/src/serializer.cc.o.d -o CMakeFiles/ccls.dir/src/serializer.cc.o -c /<<PKGBUILDDIR>>/src/serializer.cc
In member function 'std::vector<_Tp, _Alloc>::reference std::vector<_Tp, _Alloc>::emplace_back(_Args&& ...) [with _Args = {ccls::InMessage}; _Tp = ccls::InMessage; _Alloc = std::allocator<ccls::InMessage>]',
    inlined from 'std::vector<T> ccls::ThreadedQueue<T>::dequeueAll() [with T = ccls::InMessage]' at /<<PKGBUILDDIR>>/src/threaded_queue.hh:114:26,
    inlined from 'void ccls::pipeline::mainLoop()' at /<<PKGBUILDDIR>>/src/pipeline.cc:675:62:
/usr/include/c++/13/bits/vector.tcc:123:28: note: parameter passing for argument of type '__gnu_cxx::__normal_iterator<ccls::InMessage*, std::vector<ccls::InMessage, std::allocator<ccls::InMessage> > >' changed in GCC 7.1
  123 |           _M_realloc_insert(end(), std::forward<_Args>(__args)...);
      |           ~~~~~~~~~~~~~~~~~^~~~~~~~~~~~~~~~~~~~~~~~~~~~~~~~~~~~~~~
In member function 'std::vector<_Tp, _Alloc>::reference std::vector<_Tp, _Alloc>::emplace_back(_Args&& ...) [with _Args = {ccls::InMessage}; _Tp = ccls::InMessage; _Alloc = std::allocator<ccls::InMessage>]',
    inlined from 'std::vector<T> ccls::ThreadedQueue<T>::dequeueAll() [with T = ccls::InMessage]' at /<<PKGBUILDDIR>>/src/threaded_queue.hh:118:26,
    inlined from 'void ccls::pipeline::mainLoop()' at /<<PKGBUILDDIR>>/src/pipeline.cc:675:62:
/usr/include/c++/13/bits/vector.tcc:123:28: note: parameter passing for argument of type '__gnu_cxx::__normal_iterator<ccls::InMessage*, std::vector<ccls::InMessage, std::allocator<ccls::InMessage> > >' changed in GCC 7.1
  123 |           _M_realloc_insert(end(), std::forward<_Args>(__args)...);
      |           ~~~~~~~~~~~~~~~~~^~~~~~~~~~~~~~~~~~~~~~~~~~~~~~~~~~~~~~~
[ 46%] Building CXX object CMakeFiles/ccls.dir/src/test.cc.o
/usr/bin/c++  -I/<<PKGBUILDDIR>>/src -isystem /<<PKGBUILDDIR>>/third_party -isystem /usr/lib/llvm-16/include -g -O2 -ffile-prefix-map=/<<PKGBUILDDIR>>=. -fstack-protector-strong -fstack-clash-protection -Wformat -Werror=format-security -Wdate-time -D_FORTIFY_SOURCE=2 -std=c++17 -Wall -Wno-sign-compare -Wno-return-type -Wno-unused-result -MD -MT CMakeFiles/ccls.dir/src/test.cc.o -MF CMakeFiles/ccls.dir/src/test.cc.o.d -o CMakeFiles/ccls.dir/src/test.cc.o -c /<<PKGBUILDDIR>>/src/test.cc
[ 48%] Building CXX object CMakeFiles/ccls.dir/src/utils.cc.o
/usr/bin/c++  -DCLANG_RESOURCE_DIRECTORY="R\"(/usr/include/clang/16)\"" -I/<<PKGBUILDDIR>>/src -isystem /<<PKGBUILDDIR>>/third_party -isystem /usr/lib/llvm-16/include -g -O2 -ffile-prefix-map=/<<PKGBUILDDIR>>=. -fstack-protector-strong -fstack-clash-protection -Wformat -Werror=format-security -Wdate-time -D_FORTIFY_SOURCE=2 -std=c++17 -Wall -Wno-sign-compare -Wno-return-type -Wno-unused-result -MD -MT CMakeFiles/ccls.dir/src/utils.cc.o -MF CMakeFiles/ccls.dir/src/utils.cc.o.d -o CMakeFiles/ccls.dir/src/utils.cc.o -c /<<PKGBUILDDIR>>/src/utils.cc
In file included from /usr/include/c++/13/vector:72,
                 from /<<PKGBUILDDIR>>/src/utils.hh:13,
                 from /<<PKGBUILDDIR>>/src/serializer.hh:6,
                 from /<<PKGBUILDDIR>>/src/serializer.cc:4:
/usr/include/c++/13/bits/vector.tcc: In member function 'void std::vector<_Tp, _Alloc>::_M_realloc_insert(iterator, _Args&& ...) [with _Args = {}; _Tp = long long unsigned int; _Alloc = std::allocator<long long unsigned int>]':
/usr/include/c++/13/bits/vector.tcc:445:7: note: parameter passing for argument of type 'std::vector<long long unsigned int, std::allocator<long long unsigned int> >::iterator' changed in GCC 7.1
  445 |       vector<_Tp, _Alloc>::
      |       ^~~~~~~~~~~~~~~~~~~
In member function 'std::vector<_Tp, _Alloc>::reference std::vector<_Tp, _Alloc>::emplace_back(_Args&& ...) [with _Args = {}; _Tp = long long unsigned int; _Alloc = std::allocator<long long unsigned int>]',
    inlined from 'ccls::reflect<long long unsigned int>(JsonReader&, std::vector<long long unsigned int, std::allocator<long long unsigned int> >&)::<lambda()>' at /<<PKGBUILDDIR>>/src/serializer.hh:347:19,
    inlined from 'static Ret llvm::function_ref<Ret(Params ...)>::callback_fn(intptr_t, Params ...) [with Callable = ccls::reflect<long long unsigned int>(JsonReader&, std::vector<long long unsigned int, std::allocator<long long unsigned int> >&)::<lambda()>; Ret = void; Params = {}]' at /usr/include/llvm-16/llvm/ADT/STLFunctionalExtras.h:45:52:
/usr/include/c++/13/bits/vector.tcc:123:28: note: parameter passing for argument of type '__gnu_cxx::__normal_iterator<long long unsigned int*, std::vector<long long unsigned int, std::allocator<long long unsigned int> > >' changed in GCC 7.1
  123 |           _M_realloc_insert(end(), std::forward<_Args>(__args)...);
      |           ~~~~~~~~~~~~~~~~~^~~~~~~~~~~~~~~~~~~~~~~~~~~~~~~~~~~~~~~
In member function 'std::vector<_Tp, _Alloc>::reference std::vector<_Tp, _Alloc>::emplace_back(_Args&& ...) [with _Args = {}; _Tp = long long unsigned int; _Alloc = std::allocator<long long unsigned int>]',
    inlined from 'void ccls::reflect(BinaryReader&, std::vector<T>&) [with T = long long unsigned int]' at /<<PKGBUILDDIR>>/src/serializer.hh:359:19:
/usr/include/c++/13/bits/vector.tcc:123:28: note: parameter passing for argument of type '__gnu_cxx::__normal_iterator<long long unsigned int*, std::vector<long long unsigned int, std::allocator<long long unsigned int> > >' changed in GCC 7.1
  123 |           _M_realloc_insert(end(), std::forward<_Args>(__args)...);
      |           ~~~~~~~~~~~~~~~~~^~~~~~~~~~~~~~~~~~~~~~~~~~~~~~~~~~~~~~~
/usr/include/c++/13/bits/vector.tcc: In member function 'void std::vector<_Tp, _Alloc>::_M_realloc_insert(iterator, _Args&& ...) [with _Args = {}; _Tp = ccls::SymbolRef; _Alloc = std::allocator<ccls::SymbolRef>]':
/usr/include/c++/13/bits/vector.tcc:445:7: note: parameter passing for argument of type 'std::vector<ccls::SymbolRef, std::allocator<ccls::SymbolRef> >::iterator' changed in GCC 7.1
  445 |       vector<_Tp, _Alloc>::
      |       ^~~~~~~~~~~~~~~~~~~
In member function 'std::vector<_Tp, _Alloc>::reference std::vector<_Tp, _Alloc>::emplace_back(_Args&& ...) [with _Args = {}; _Tp = ccls::SymbolRef; _Alloc = std::allocator<ccls::SymbolRef>]',
    inlined from 'ccls::reflect<SymbolRef>(JsonReader&, std::vector<SymbolRef, std::allocator<SymbolRef> >&)::<lambda()>' at /<<PKGBUILDDIR>>/src/serializer.hh:347:19,
    inlined from 'static Ret llvm::function_ref<Ret(Params ...)>::callback_fn(intptr_t, Params ...) [with Callable = ccls::reflect<SymbolRef>(JsonReader&, std::vector<SymbolRef, std::allocator<SymbolRef> >&)::<lambda()>; Ret = void; Params = {}]' at /usr/include/llvm-16/llvm/ADT/STLFunctionalExtras.h:45:52:
/usr/include/c++/13/bits/vector.tcc:123:28: note: parameter passing for argument of type '__gnu_cxx::__normal_iterator<ccls::SymbolRef*, std::vector<ccls::SymbolRef, std::allocator<ccls::SymbolRef> > >' changed in GCC 7.1
  123 |           _M_realloc_insert(end(), std::forward<_Args>(__args)...);
      |           ~~~~~~~~~~~~~~~~~^~~~~~~~~~~~~~~~~~~~~~~~~~~~~~~~~~~~~~~
/usr/include/c++/13/bits/vector.tcc: In member function 'void std::vector<_Tp, _Alloc>::_M_realloc_insert(iterator, _Args&& ...) [with _Args = {}; _Tp = std::pair<long long unsigned int, long long int>; _Alloc = std::allocator<std::pair<long long unsigned int, long long int> >]':
/usr/include/c++/13/bits/vector.tcc:445:7: note: parameter passing for argument of type 'std::vector<std::pair<long long unsigned int, long long int>, std::allocator<std::pair<long long unsigned int, long long int> > >::iterator' changed in GCC 7.1
  445 |       vector<_Tp, _Alloc>::
      |       ^~~~~~~~~~~~~~~~~~~
In member function 'std::vector<_Tp, _Alloc>::reference std::vector<_Tp, _Alloc>::emplace_back(_Args&& ...) [with _Args = {}; _Tp = std::pair<long long unsigned int, long long int>; _Alloc = std::allocator<std::pair<long long unsigned int, long long int> >]',
    inlined from 'ccls::reflect<std::pair<long long unsigned int, long long int> >(JsonReader&, std::vector<std::pair<long long unsigned int, long long int>, std::allocator<std::pair<long long unsigned int, long long int> > >&)::<lambda()>' at /<<PKGBUILDDIR>>/src/serializer.hh:347:19,
    inlined from 'static Ret llvm::function_ref<Ret(Params ...)>::callback_fn(intptr_t, Params ...) [with Callable = ccls::reflect<std::pair<long long unsigned int, long long int> >(JsonReader&, std::vector<std::pair<long long unsigned int, long long int>, std::allocator<std::pair<long long unsigned int, long long int> > >&)::<lambda()>; Ret = void; Params = {}]' at /usr/include/llvm-16/llvm/ADT/STLFunctionalExtras.h:45:52:
/usr/include/c++/13/bits/vector.tcc:123:28: note: parameter passing for argument of type '__gnu_cxx::__normal_iterator<std::pair<long long unsigned int, long long int>*, std::vector<std::pair<long long unsigned int, long long int>, std::allocator<std::pair<long long unsigned int, long long int> > > >' changed in GCC 7.1
  123 |           _M_realloc_insert(end(), std::forward<_Args>(__args)...);
      |           ~~~~~~~~~~~~~~~~~^~~~~~~~~~~~~~~~~~~~~~~~~~~~~~~~~~~~~~~
In member function 'std::vector<_Tp, _Alloc>::reference std::vector<_Tp, _Alloc>::emplace_back(_Args&& ...) [with _Args = {}; _Tp = ccls::SymbolRef; _Alloc = std::allocator<ccls::SymbolRef>]',
    inlined from 'void ccls::reflect(BinaryReader&, std::vector<T>&) [with T = SymbolRef]' at /<<PKGBUILDDIR>>/src/serializer.hh:359:19,
    inlined from 'void ccls::reflectMember(BinaryReader&, const char*, T&) [with T = std::vector<SymbolRef, std::allocator<SymbolRef> >]' at /<<PKGBUILDDIR>>/src/serializer.hh:389:10,
    inlined from 'void ccls::reflect1(TVisitor&, IndexFunc&) [with TVisitor = BinaryReader]' at /<<PKGBUILDDIR>>/src/serializer.cc:297:3:
/usr/include/c++/13/bits/vector.tcc:123:28: note: parameter passing for argument of type '__gnu_cxx::__normal_iterator<ccls::SymbolRef*, std::vector<ccls::SymbolRef, std::allocator<ccls::SymbolRef> > >' changed in GCC 7.1
  123 |           _M_realloc_insert(end(), std::forward<_Args>(__args)...);
      |           ~~~~~~~~~~~~~~~~~^~~~~~~~~~~~~~~~~~~~~~~~~~~~~~~~~~~~~~~
In member function 'std::vector<_Tp, _Alloc>::reference std::vector<_Tp, _Alloc>::emplace_back(_Args&& ...) [with _Args = {}; _Tp = std::pair<long long unsigned int, long long int>; _Alloc = std::allocator<std::pair<long long unsigned int, long long int> >]',
    inlined from 'void ccls::reflect(BinaryReader&, std::vector<T>&) [with T = std::pair<long long unsigned int, long long int>]' at /<<PKGBUILDDIR>>/src/serializer.hh:359:19,
    inlined from 'void ccls::reflectMember(BinaryReader&, const char*, T&) [with T = std::vector<std::pair<long long unsigned int, long long int>, std::allocator<std::pair<long long unsigned int, long long int> > >]' at /<<PKGBUILDDIR>>/src/serializer.hh:389:10,
    inlined from 'void ccls::reflect1(Vis&, IndexType&) [with Vis = BinaryReader]' at /<<PKGBUILDDIR>>/src/serializer.cc:323:3:
/usr/include/c++/13/bits/vector.tcc:123:28: note: parameter passing for argument of type '__gnu_cxx::__normal_iterator<std::pair<long long unsigned int, long long int>*, std::vector<std::pair<long long unsigned int, long long int>, std::allocator<std::pair<long long unsigned int, long long int> > > >' changed in GCC 7.1
  123 |           _M_realloc_insert(end(), std::forward<_Args>(__args)...);
      |           ~~~~~~~~~~~~~~~~~^~~~~~~~~~~~~~~~~~~~~~~~~~~~~~~~~~~~~~~
In file included from /usr/include/c++/13/memory:69,
                 from /<<PKGBUILDDIR>>/src/utils.hh:10:
/usr/include/c++/13/bits/stl_uninitialized.h: In function '_ForwardIterator std::__do_uninit_copy(_InputIterator, _InputIterator, _ForwardIterator) [with _InputIterator = __detail::_Node_iterator<pair<const long long unsigned int, ccls::IndexFunc>, false, false>; _ForwardIterator = pair<long long unsigned int, ccls::IndexFunc>*]':
/usr/include/c++/13/bits/stl_uninitialized.h:113:5: note: parameter passing for argument of type 'std::__detail::_Node_iterator<std::pair<const long long unsigned int, ccls::IndexFunc>, false, false>' changed in GCC 7.1
  113 |     __do_uninit_copy(_InputIterator __first, _InputIterator __last,
      |     ^~~~~~~~~~~~~~~~
/usr/include/c++/13/bits/stl_uninitialized.h:113:5: note: parameter passing for argument of type 'std::__detail::_Node_iterator<std::pair<const long long unsigned int, ccls::IndexFunc>, false, false>' changed in GCC 7.1
In static member function 'static _ForwardIterator std::__uninitialized_copy<_TrivialValueTypes>::__uninit_copy(_InputIterator, _InputIterator, _ForwardIterator) [with _InputIterator = std::__detail::_Node_iterator<std::pair<const long long unsigned int, ccls::IndexFunc>, false, false>; _ForwardIterator = std::pair<long long unsigned int, ccls::IndexFunc>*; bool _TrivialValueTypes = false]',
    inlined from '_ForwardIterator std::uninitialized_copy(_InputIterator, _InputIterator, _ForwardIterator) [with _InputIterator = __detail::_Node_iterator<pair<const long long unsigned int, ccls::IndexFunc>, false, false>; _ForwardIterator = pair<long long unsigned int, ccls::IndexFunc>*]' at /usr/include/c++/13/bits/stl_uninitialized.h:185:15,
    inlined from '_ForwardIterator std::__uninitialized_copy_a(_InputIterator, _InputIterator, _ForwardIterator, allocator<_Tp>&) [with _InputIterator = __detail::_Node_iterator<pair<const long long unsigned int, ccls::IndexFunc>, false, false>; _ForwardIterator = pair<long long unsigned int, ccls::IndexFunc>*; _Tp = pair<long long unsigned int, ccls::IndexFunc>]' at /usr/include/c++/13/bits/stl_uninitialized.h:373:37,
    inlined from 'void std::vector<_Tp, _Alloc>::_M_range_initialize(_ForwardIterator, _ForwardIterator, std::forward_iterator_tag) [with _ForwardIterator = std::__detail::_Node_iterator<std::pair<const long long unsigned int, ccls::IndexFunc>, false, false>; _Tp = std::pair<long long unsigned int, ccls::IndexFunc>; _Alloc = std::allocator<std::pair<long long unsigned int, ccls::IndexFunc> >]' at /usr/include/c++/13/bits/stl_vector.h:1692:33,
    inlined from 'std::vector<_Tp, _Alloc>::vector(_InputIterator, _InputIterator, const allocator_type&) [with _InputIterator = std::__detail::_Node_iterator<std::pair<const long long unsigned int, ccls::IndexFunc>, false, false>; <template-parameter-2-2> = void; _Tp = std::pair<long long unsigned int, ccls::IndexFunc>; _Alloc = std::allocator<std::pair<long long unsigned int, ccls::IndexFunc> >]' at /usr/include/c++/13/bits/stl_vector.h:708:23,
    inlined from 'void ccls::reflect(JsonWriter&, std::unordered_map<long long unsigned int, V>&) [with V = IndexFunc]' at /<<PKGBUILDDIR>>/src/serializer.cc:157:39:
/usr/include/c++/13/bits/stl_uninitialized.h:137:39: note: parameter passing for argument of type 'std::__detail::_Node_iterator<std::pair<const long long unsigned int, ccls::IndexFunc>, false, false>' changed in GCC 7.1
  137 |         { return std::__do_uninit_copy(__first, __last, __result); }
      |                  ~~~~~~~~~~~~~~~~~~~~~^~~~~~~~~~~~~~~~~~~~~~~~~~~
/usr/include/c++/13/bits/stl_uninitialized.h: In function '_ForwardIterator std::__do_uninit_copy(_InputIterator, _InputIterator, _ForwardIterator) [with _InputIterator = __detail::_Node_iterator<pair<const long long unsigned int, ccls::IndexType>, false, false>; _ForwardIterator = pair<long long unsigned int, ccls::IndexType>*]':
/usr/include/c++/13/bits/stl_uninitialized.h:113:5: note: parameter passing for argument of type 'std::__detail::_Node_iterator<std::pair<const long long unsigned int, ccls::IndexType>, false, false>' changed in GCC 7.1
  113 |     __do_uninit_copy(_InputIterator __first, _InputIterator __last,
      |     ^~~~~~~~~~~~~~~~
/usr/include/c++/13/bits/stl_uninitialized.h:113:5: note: parameter passing for argument of type 'std::__detail::_Node_iterator<std::pair<const long long unsigned int, ccls::IndexType>, false, false>' changed in GCC 7.1
In static member function 'static _ForwardIterator std::__uninitialized_copy<_TrivialValueTypes>::__uninit_copy(_InputIterator, _InputIterator, _ForwardIterator) [with _InputIterator = std::__detail::_Node_iterator<std::pair<const long long unsigned int, ccls::IndexType>, false, false>; _ForwardIterator = std::pair<long long unsigned int, ccls::IndexType>*; bool _TrivialValueTypes = false]',
    inlined from '_ForwardIterator std::uninitialized_copy(_InputIterator, _InputIterator, _ForwardIterator) [with _InputIterator = __detail::_Node_iterator<pair<const long long unsigned int, ccls::IndexType>, false, false>; _ForwardIterator = pair<long long unsigned int, ccls::IndexType>*]' at /usr/include/c++/13/bits/stl_uninitialized.h:185:15,
    inlined from '_ForwardIterator std::__uninitialized_copy_a(_InputIterator, _InputIterator, _ForwardIterator, allocator<_Tp>&) [with _InputIterator = __detail::_Node_iterator<pair<const long long unsigned int, ccls::IndexType>, false, false>; _ForwardIterator = pair<long long unsigned int, ccls::IndexType>*; _Tp = pair<long long unsigned int, ccls::IndexType>]' at /usr/include/c++/13/bits/stl_uninitialized.h:373:37,
    inlined from 'void std::vector<_Tp, _Alloc>::_M_range_initialize(_ForwardIterator, _ForwardIterator, std::forward_iterator_tag) [with _ForwardIterator = std::__detail::_Node_iterator<std::pair<const long long unsigned int, ccls::IndexType>, false, false>; _Tp = std::pair<long long unsigned int, ccls::IndexType>; _Alloc = std::allocator<std::pair<long long unsigned int, ccls::IndexType> >]' at /usr/include/c++/13/bits/stl_vector.h:1692:33,
    inlined from 'std::vector<_Tp, _Alloc>::vector(_InputIterator, _InputIterator, const allocator_type&) [with _InputIterator = std::__detail::_Node_iterator<std::pair<const long long unsigned int, ccls::IndexType>, false, false>; <template-parameter-2-2> = void; _Tp = std::pair<long long unsigned int, ccls::IndexType>; _Alloc = std::allocator<std::pair<long long unsigned int, ccls::IndexType> >]' at /usr/include/c++/13/bits/stl_vector.h:708:23,
    inlined from 'void ccls::reflect(JsonWriter&, std::unordered_map<long long unsigned int, V>&) [with V = IndexType]' at /<<PKGBUILDDIR>>/src/serializer.cc:157:39:
/usr/include/c++/13/bits/stl_uninitialized.h:137:39: note: parameter passing for argument of type 'std::__detail::_Node_iterator<std::pair<const long long unsigned int, ccls::IndexType>, false, false>' changed in GCC 7.1
  137 |         { return std::__do_uninit_copy(__first, __last, __result); }
      |                  ~~~~~~~~~~~~~~~~~~~~~^~~~~~~~~~~~~~~~~~~~~~~~~~~
[ 51%] Building CXX object CMakeFiles/ccls.dir/src/working_files.cc.o
/usr/bin/c++  -I/<<PKGBUILDDIR>>/src -isystem /<<PKGBUILDDIR>>/third_party -isystem /usr/lib/llvm-16/include -g -O2 -ffile-prefix-map=/<<PKGBUILDDIR>>=. -fstack-protector-strong -fstack-clash-protection -Wformat -Werror=format-security -Wdate-time -D_FORTIFY_SOURCE=2 -std=c++17 -Wall -Wno-sign-compare -Wno-return-type -Wno-unused-result -MD -MT CMakeFiles/ccls.dir/src/working_files.cc.o -MF CMakeFiles/ccls.dir/src/working_files.cc.o.d -o CMakeFiles/ccls.dir/src/working_files.cc.o -c /<<PKGBUILDDIR>>/src/working_files.cc
[ 53%] Building CXX object CMakeFiles/ccls.dir/src/messages/ccls_call.cc.o
/usr/bin/c++  -I/<<PKGBUILDDIR>>/src -isystem /<<PKGBUILDDIR>>/third_party -isystem /usr/lib/llvm-16/include -g -O2 -ffile-prefix-map=/<<PKGBUILDDIR>>=. -fstack-protector-strong -fstack-clash-protection -Wformat -Werror=format-security -Wdate-time -D_FORTIFY_SOURCE=2 -std=c++17 -Wall -Wno-sign-compare -Wno-return-type -Wno-unused-result -MD -MT CMakeFiles/ccls.dir/src/messages/ccls_call.cc.o -MF CMakeFiles/ccls.dir/src/messages/ccls_call.cc.o.d -o CMakeFiles/ccls.dir/src/messages/ccls_call.cc.o -c /<<PKGBUILDDIR>>/src/messages/ccls_call.cc
[ 55%] Building CXX object CMakeFiles/ccls.dir/src/messages/ccls_info.cc.o
/usr/bin/c++  -I/<<PKGBUILDDIR>>/src -isystem /<<PKGBUILDDIR>>/third_party -isystem /usr/lib/llvm-16/include -g -O2 -ffile-prefix-map=/<<PKGBUILDDIR>>=. -fstack-protector-strong -fstack-clash-protection -Wformat -Werror=format-security -Wdate-time -D_FORTIFY_SOURCE=2 -std=c++17 -Wall -Wno-sign-compare -Wno-return-type -Wno-unused-result -MD -MT CMakeFiles/ccls.dir/src/messages/ccls_info.cc.o -MF CMakeFiles/ccls.dir/src/messages/ccls_info.cc.o.d -o CMakeFiles/ccls.dir/src/messages/ccls_info.cc.o -c /<<PKGBUILDDIR>>/src/messages/ccls_info.cc
[ 58%] Building CXX object CMakeFiles/ccls.dir/src/messages/ccls_inheritance.cc.o
/usr/bin/c++  -I/<<PKGBUILDDIR>>/src -isystem /<<PKGBUILDDIR>>/third_party -isystem /usr/lib/llvm-16/include -g -O2 -ffile-prefix-map=/<<PKGBUILDDIR>>=. -fstack-protector-strong -fstack-clash-protection -Wformat -Werror=format-security -Wdate-time -D_FORTIFY_SOURCE=2 -std=c++17 -Wall -Wno-sign-compare -Wno-return-type -Wno-unused-result -MD -MT CMakeFiles/ccls.dir/src/messages/ccls_inheritance.cc.o -MF CMakeFiles/ccls.dir/src/messages/ccls_inheritance.cc.o.d -o CMakeFiles/ccls.dir/src/messages/ccls_inheritance.cc.o -c /<<PKGBUILDDIR>>/src/messages/ccls_inheritance.cc
In file included from /usr/include/c++/13/bits/stl_algo.h:61,
                 from /usr/include/c++/13/algorithm:61,
                 from /usr/include/llvm-16/llvm/ADT/Hashing.h:51,
                 from /usr/lib/llvm-16/include/clang/Basic/CustomizableOptional.h:12,
                 from /usr/lib/llvm-16/include/clang/Basic/DirectoryEntry.h:17,
                 from /usr/lib/llvm-16/include/clang/Basic/FileManager.h:17,
                 from /<<PKGBUILDDIR>>/src/clang_tu.hh:8,
                 from /<<PKGBUILDDIR>>/src/sema_manager.hh:6,
                 from /<<PKGBUILDDIR>>/src/sema_manager.cc:4:
/usr/include/c++/13/bits/stl_heap.h: In function 'void std::__adjust_heap(_RandomAccessIterator, _Distance, _Distance, _Tp, _Compare) [with _RandomAccessIterator = __gnu_cxx::__normal_iterator<pair<__cxx11::basic_string<char>, long long int>*, vector<pair<__cxx11::basic_string<char>, long long int> > >; _Distance = int; _Tp = pair<__cxx11::basic_string<char>, long long int>; _Compare = __gnu_cxx::__ops::_Iter_less_iter]':
/usr/include/c++/13/bits/stl_heap.h:224:5: note: parameter passing for argument of type '__gnu_cxx::__normal_iterator<std::pair<std::__cxx11::basic_string<char>, long long int>*, std::vector<std::pair<std::__cxx11::basic_string<char>, long long int> > >' changed in GCC 7.1
  224 |     __adjust_heap(_RandomAccessIterator __first, _Distance __holeIndex,
      |     ^~~~~~~~~~~~~
In file included from /usr/include/c++/13/functional:67,
                 from /<<PKGBUILDDIR>>/src/serializer.hh:14,
                 from /<<PKGBUILDDIR>>/src/config.hh:6,
                 from /<<PKGBUILDDIR>>/src/lsp.hh:6,
                 from /<<PKGBUILDDIR>>/src/hierarchy.hh:6,
                 from /<<PKGBUILDDIR>>/src/messages/ccls_call.cc:4:
/usr/include/c++/13/bits/stl_algo.h: In function 'void std::__unguarded_linear_insert(_RandomAccessIterator, _Compare) [with _RandomAccessIterator = __gnu_cxx::__normal_iterator<ccls::{anonymous}::Out_cclsCall*, vector<ccls::{anonymous}::Out_cclsCall> >; _Compare = __gnu_cxx::__ops::_Val_less_iter]':
/usr/include/c++/13/bits/stl_algo.h:1792:5: note: parameter passing for argument of type '__gnu_cxx::__normal_iterator<ccls::{anonymous}::Out_cclsCall*, std::vector<ccls::{anonymous}::Out_cclsCall> >' changed in GCC 7.1
 1792 |     __unguarded_linear_insert(_RandomAccessIterator __last,
      |     ^~~~~~~~~~~~~~~~~~~~~~~~~
/usr/include/c++/13/bits/stl_algo.h: In function 'void std::__unguarded_linear_insert(_RandomAccessIterator, _Compare) [with _RandomAccessIterator = __gnu_cxx::__normal_iterator<pair<__cxx11::basic_string<char>, long long int>*, vector<pair<__cxx11::basic_string<char>, long long int> > >; _Compare = __gnu_cxx::__ops::_Val_less_iter]':
/usr/include/c++/13/bits/stl_algo.h:1792:5: note: parameter passing for argument of type '__gnu_cxx::__normal_iterator<std::pair<std::__cxx11::basic_string<char>, long long int>*, std::vector<std::pair<std::__cxx11::basic_string<char>, long long int> > >' changed in GCC 7.1
 1792 |     __unguarded_linear_insert(_RandomAccessIterator __last,
      |     ^~~~~~~~~~~~~~~~~~~~~~~~~
/usr/include/c++/13/bits/stl_algo.h: In function 'void std::__insertion_sort(_RandomAccessIterator, _RandomAccessIterator, _Compare) [with _RandomAccessIterator = __gnu_cxx::__normal_iterator<pair<__cxx11::basic_string<char>, long long int>*, vector<pair<__cxx11::basic_string<char>, long long int> > >; _Compare = __gnu_cxx::__ops::_Iter_less_iter]':
/usr/include/c++/13/bits/stl_algo.h:1812:5: note: parameter passing for argument of type '__gnu_cxx::__normal_iterator<std::pair<std::__cxx11::basic_string<char>, long long int>*, std::vector<std::pair<std::__cxx11::basic_string<char>, long long int> > >' changed in GCC 7.1
 1812 |     __insertion_sort(_RandomAccessIterator __first,
      |     ^~~~~~~~~~~~~~~~
/usr/include/c++/13/bits/stl_algo.h:1812:5: note: parameter passing for argument of type '__gnu_cxx::__normal_iterator<std::pair<std::__cxx11::basic_string<char>, long long int>*, std::vector<std::pair<std::__cxx11::basic_string<char>, long long int> > >' changed in GCC 7.1
/usr/include/c++/13/bits/stl_algo.h: In function 'void std::__insertion_sort(_RandomAccessIterator, _RandomAccessIterator, _Compare) [with _RandomAccessIterator = __gnu_cxx::__normal_iterator<ccls::{anonymous}::Out_cclsCall*, vector<ccls::{anonymous}::Out_cclsCall> >; _Compare = __gnu_cxx::__ops::_Iter_less_iter]':
/usr/include/c++/13/bits/stl_algo.h:1812:5: note: parameter passing for argument of type '__gnu_cxx::__normal_iterator<ccls::{anonymous}::Out_cclsCall*, std::vector<ccls::{anonymous}::Out_cclsCall> >' changed in GCC 7.1
 1812 |     __insertion_sort(_RandomAccessIterator __first,
      |     ^~~~~~~~~~~~~~~~
/usr/include/c++/13/bits/stl_algo.h:1812:5: note: parameter passing for argument of type '__gnu_cxx::__normal_iterator<ccls::{anonymous}::Out_cclsCall*, std::vector<ccls::{anonymous}::Out_cclsCall> >' changed in GCC 7.1
In file included from /usr/include/c++/13/bits/stl_algo.h:61:
/usr/include/c++/13/bits/stl_heap.h: In function 'void std::__adjust_heap(_RandomAccessIterator, _Distance, _Distance, _Tp, _Compare) [with _RandomAccessIterator = __gnu_cxx::__normal_iterator<ccls::{anonymous}::Out_cclsCall*, vector<ccls::{anonymous}::Out_cclsCall> >; _Distance = int; _Tp = ccls::{anonymous}::Out_cclsCall; _Compare = __gnu_cxx::__ops::_Iter_less_iter]':
/usr/include/c++/13/bits/stl_heap.h:224:5: note: parameter passing for argument of type '__gnu_cxx::__normal_iterator<ccls::{anonymous}::Out_cclsCall*, std::vector<ccls::{anonymous}::Out_cclsCall> >' changed in GCC 7.1
  224 |     __adjust_heap(_RandomAccessIterator __first, _Distance __holeIndex,
      |     ^~~~~~~~~~~~~
/usr/include/c++/13/bits/stl_algo.h: In function 'void std::__introsort_loop(_RandomAccessIterator, _RandomAccessIterator, _Size, _Compare) [with _RandomAccessIterator = __gnu_cxx::__normal_iterator<ccls::{anonymous}::Out_cclsCall*, vector<ccls::{anonymous}::Out_cclsCall> >; _Size = int; _Compare = __gnu_cxx::__ops::_Iter_less_iter]':
/usr/include/c++/13/bits/stl_algo.h:1918:5: note: parameter passing for argument of type '__gnu_cxx::__normal_iterator<ccls::{anonymous}::Out_cclsCall*, std::vector<ccls::{anonymous}::Out_cclsCall> >' changed in GCC 7.1
 1918 |     __introsort_loop(_RandomAccessIterator __first,
      |     ^~~~~~~~~~~~~~~~
/usr/include/c++/13/bits/stl_algo.h:1918:5: note: parameter passing for argument of type '__gnu_cxx::__normal_iterator<ccls::{anonymous}::Out_cclsCall*, std::vector<ccls::{anonymous}::Out_cclsCall> >' changed in GCC 7.1
/usr/include/c++/13/bits/stl_algo.h:1932:32: note: parameter passing for argument of type '__gnu_cxx::__normal_iterator<ccls::{anonymous}::Out_cclsCall*, std::vector<ccls::{anonymous}::Out_cclsCall> >' changed in GCC 7.1
 1932 |           std::__introsort_loop(__cut, __last, __depth_limit, __comp);
      |           ~~~~~~~~~~~~~~~~~~~~~^~~~~~~~~~~~~~~~~~~~~~~~~~~~~~~~~~~~~~
In file included from /usr/include/c++/13/vector:72,
                 from /<<PKGBUILDDIR>>/src/utils.hh:13,
                 from /<<PKGBUILDDIR>>/src/position.hh:6,
                 from /<<PKGBUILDDIR>>/src/clang_tu.hh:6:
/usr/include/c++/13/bits/vector.tcc: In member function 'void std::vector<_Tp, _Alloc>::_M_realloc_insert(iterator, _Args&& ...) [with _Args = {std::__cxx11::basic_string<char, std::char_traits<char>, std::allocator<char> >, long int}; _Tp = std::pair<std::__cxx11::basic_string<char>, long long int>; _Alloc = std::allocator<std::pair<std::__cxx11::basic_string<char>, long long int> >]':
/usr/include/c++/13/bits/vector.tcc:445:7: note: parameter passing for argument of type 'std::vector<std::pair<std::__cxx11::basic_string<char>, long long int> >::iterator' changed in GCC 7.1
  445 |       vector<_Tp, _Alloc>::
      |       ^~~~~~~~~~~~~~~~~~~
[ 60%] Building CXX object CMakeFiles/ccls.dir/src/messages/ccls_member.cc.o
/usr/bin/c++  -I/<<PKGBUILDDIR>>/src -isystem /<<PKGBUILDDIR>>/third_party -isystem /usr/lib/llvm-16/include -g -O2 -ffile-prefix-map=/<<PKGBUILDDIR>>=. -fstack-protector-strong -fstack-clash-protection -Wformat -Werror=format-security -Wdate-time -D_FORTIFY_SOURCE=2 -std=c++17 -Wall -Wno-sign-compare -Wno-return-type -Wno-unused-result -MD -MT CMakeFiles/ccls.dir/src/messages/ccls_member.cc.o -MF CMakeFiles/ccls.dir/src/messages/ccls_member.cc.o.d -o CMakeFiles/ccls.dir/src/messages/ccls_member.cc.o -c /<<PKGBUILDDIR>>/src/messages/ccls_member.cc
In member function 'std::vector<_Tp, _Alloc>::reference std::vector<_Tp, _Alloc>::emplace_back(_Args&& ...) [with _Args = {std::__cxx11::basic_string<char, std::char_traits<char>, std::allocator<char> >, long int}; _Tp = std::pair<std::__cxx11::basic_string<char>, long long int>; _Alloc = std::allocator<std::pair<std::__cxx11::basic_string<char>, long long int> >]',
    inlined from 'virtual void ccls::{anonymous}::StoreInclude::InclusionDirective(clang::SourceLocation, const clang::Token&, llvm::StringRef, bool, clang::CharSourceRange, clang::OptionalFileEntryRef, llvm::StringRef, llvm::StringRef, const clang::Module*, clang::SrcMgr::CharacteristicKind)' at /<<PKGBUILDDIR>>/src/sema_manager.cc:197:23:
/usr/include/c++/13/bits/vector.tcc:123:28: note: parameter passing for argument of type '__gnu_cxx::__normal_iterator<std::pair<std::__cxx11::basic_string<char>, long long int>*, std::vector<std::pair<std::__cxx11::basic_string<char>, long long int> > >' changed in GCC 7.1
  123 |           _M_realloc_insert(end(), std::forward<_Args>(__args)...);
      |           ~~~~~~~~~~~~~~~~~^~~~~~~~~~~~~~~~~~~~~~~~~~~~~~~~~~~~~~~
/usr/include/c++/13/bits/stl_algo.h: In function 'void std::__introsort_loop(_RandomAccessIterator, _RandomAccessIterator, _Size, _Compare) [with _RandomAccessIterator = __gnu_cxx::__normal_iterator<pair<__cxx11::basic_string<char>, long long int>*, vector<pair<__cxx11::basic_string<char>, long long int> > >; _Size = int; _Compare = __gnu_cxx::__ops::_Iter_less_iter]':
/usr/include/c++/13/bits/stl_algo.h:1918:5: note: parameter passing for argument of type '__gnu_cxx::__normal_iterator<std::pair<std::__cxx11::basic_string<char>, long long int>*, std::vector<std::pair<std::__cxx11::basic_string<char>, long long int> > >' changed in GCC 7.1
 1918 |     __introsort_loop(_RandomAccessIterator __first,
      |     ^~~~~~~~~~~~~~~~
/usr/include/c++/13/bits/stl_algo.h:1918:5: note: parameter passing for argument of type '__gnu_cxx::__normal_iterator<std::pair<std::__cxx11::basic_string<char>, long long int>*, std::vector<std::pair<std::__cxx11::basic_string<char>, long long int> > >' changed in GCC 7.1
/usr/include/c++/13/bits/stl_algo.h:1932:32: note: parameter passing for argument of type '__gnu_cxx::__normal_iterator<std::pair<std::__cxx11::basic_string<char>, long long int>*, std::vector<std::pair<std::__cxx11::basic_string<char>, long long int> > >' changed in GCC 7.1
 1932 |           std::__introsort_loop(__cut, __last, __depth_limit, __comp);
      |           ~~~~~~~~~~~~~~~~~~~~~^~~~~~~~~~~~~~~~~~~~~~~~~~~~~~~~~~~~~~
In function 'void std::__sort(_RandomAccessIterator, _RandomAccessIterator, _Compare) [with _RandomAccessIterator = __gnu_cxx::__normal_iterator<pair<__cxx11::basic_string<char>, long long int>*, vector<pair<__cxx11::basic_string<char>, long long int> > >; _Compare = __gnu_cxx::__ops::_Iter_less_iter]',
    inlined from 'void std::sort(_RAIter, _RAIter) [with _RAIter = __gnu_cxx::__normal_iterator<pair<__cxx11::basic_string<char>, long long int>*, vector<pair<__cxx11::basic_string<char>, long long int> > >]' at /usr/include/c++/13/bits/stl_algo.h:4861:18,
    inlined from 'void ccls::{anonymous}::buildPreamble(ccls::Session&, clang::CompilerInvocation&, llvm::IntrusiveRefCntPtr<llvm::vfs::FileSystem>, const ccls::SemaManager::PreambleTask&, std::unique_ptr<ccls::PreambleStatCache>)' at /<<PKGBUILDDIR>>/src/sema_manager.cc:416:16,
    inlined from 'void* ccls::{anonymous}::preambleMain(void*)' at /<<PKGBUILDDIR>>/src/sema_manager.cc:452:20:
/usr/include/c++/13/bits/stl_algo.h:1947:32: note: parameter passing for argument of type '__gnu_cxx::__normal_iterator<std::pair<std::__cxx11::basic_string<char>, long long int>*, std::vector<std::pair<std::__cxx11::basic_string<char>, long long int> > >' changed in GCC 7.1
 1947 |           std::__introsort_loop(__first, __last,
      |           ~~~~~~~~~~~~~~~~~~~~~^~~~~~~~~~~~~~~~~
 1948 |                                 std::__lg(__last - __first) * 2,
      |                                 ~~~~~~~~~~~~~~~~~~~~~~~~~~~~~~~~
 1949 |                                 __comp);
      |                                 ~~~~~~~
In function 'void std::__final_insertion_sort(_RandomAccessIterator, _RandomAccessIterator, _Compare) [with _RandomAccessIterator = __gnu_cxx::__normal_iterator<pair<__cxx11::basic_string<char>, long long int>*, vector<pair<__cxx11::basic_string<char>, long long int> > >; _Compare = __gnu_cxx::__ops::_Iter_less_iter]',
    inlined from 'void std::__sort(_RandomAccessIterator, _RandomAccessIterator, _Compare) [with _RandomAccessIterator = __gnu_cxx::__normal_iterator<pair<__cxx11::basic_string<char>, long long int>*, vector<pair<__cxx11::basic_string<char>, long long int> > >; _Compare = __gnu_cxx::__ops::_Iter_less_iter]' at /usr/include/c++/13/bits/stl_algo.h:1950:31,
    inlined from 'void std::sort(_RAIter, _RAIter) [with _RAIter = __gnu_cxx::__normal_iterator<pair<__cxx11::basic_string<char>, long long int>*, vector<pair<__cxx11::basic_string<char>, long long int> > >]' at /usr/include/c++/13/bits/stl_algo.h:4861:18,
    inlined from 'void ccls::{anonymous}::buildPreamble(ccls::Session&, clang::CompilerInvocation&, llvm::IntrusiveRefCntPtr<llvm::vfs::FileSystem>, const ccls::SemaManager::PreambleTask&, std::unique_ptr<ccls::PreambleStatCache>)' at /<<PKGBUILDDIR>>/src/sema_manager.cc:416:16,
    inlined from 'void* ccls::{anonymous}::preambleMain(void*)' at /<<PKGBUILDDIR>>/src/sema_manager.cc:452:20:
/usr/include/c++/13/bits/stl_algo.h:1859:32: note: parameter passing for argument of type '__gnu_cxx::__normal_iterator<std::pair<std::__cxx11::basic_string<char>, long long int>*, std::vector<std::pair<std::__cxx11::basic_string<char>, long long int> > >' changed in GCC 7.1
 1859 |           std::__insertion_sort(__first, __first + int(_S_threshold), __comp);
      |           ~~~~~~~~~~~~~~~~~~~~~^~~~~~~~~~~~~~~~~~~~~~~~~~~~~~~~~~~~~~~~~~~~~~
/usr/include/c++/13/bits/stl_algo.h:1864:30: note: parameter passing for argument of type '__gnu_cxx::__normal_iterator<std::pair<std::__cxx11::basic_string<char>, long long int>*, std::vector<std::pair<std::__cxx11::basic_string<char>, long long int> > >' changed in GCC 7.1
 1864 |         std::__insertion_sort(__first, __last, __comp);
      |         ~~~~~~~~~~~~~~~~~~~~~^~~~~~~~~~~~~~~~~~~~~~~~~
In function 'void std::__sort(_RandomAccessIterator, _RandomAccessIterator, _Compare) [with _RandomAccessIterator = __gnu_cxx::__normal_iterator<ccls::{anonymous}::Out_cclsCall*, vector<ccls::{anonymous}::Out_cclsCall> >; _Compare = __gnu_cxx::__ops::_Iter_less_iter]',
    inlined from 'void std::sort(_RAIter, _RAIter) [with _RAIter = __gnu_cxx::__normal_iterator<ccls::{anonymous}::Out_cclsCall*, vector<ccls::{anonymous}::Out_cclsCall> >]' at /usr/include/c++/13/bits/stl_algo.h:4861:18,
    inlined from 'bool ccls::{anonymous}::expand(ccls::MessageHandler*, Out_cclsCall*, bool, CallType, bool, int)' at /<<PKGBUILDDIR>>/src/messages/ccls_call.cc:159:12:
/usr/include/c++/13/bits/stl_algo.h:1947:32: note: parameter passing for argument of type '__gnu_cxx::__normal_iterator<ccls::{anonymous}::Out_cclsCall*, std::vector<ccls::{anonymous}::Out_cclsCall> >' changed in GCC 7.1
 1947 |           std::__introsort_loop(__first, __last,
      |           ~~~~~~~~~~~~~~~~~~~~~^~~~~~~~~~~~~~~~~
 1948 |                                 std::__lg(__last - __first) * 2,
      |                                 ~~~~~~~~~~~~~~~~~~~~~~~~~~~~~~~~
 1949 |                                 __comp);
      |                                 ~~~~~~~
In function 'void std::__final_insertion_sort(_RandomAccessIterator, _RandomAccessIterator, _Compare) [with _RandomAccessIterator = __gnu_cxx::__normal_iterator<ccls::{anonymous}::Out_cclsCall*, vector<ccls::{anonymous}::Out_cclsCall> >; _Compare = __gnu_cxx::__ops::_Iter_less_iter]',
    inlined from 'void std::__sort(_RandomAccessIterator, _RandomAccessIterator, _Compare) [with _RandomAccessIterator = __gnu_cxx::__normal_iterator<ccls::{anonymous}::Out_cclsCall*, vector<ccls::{anonymous}::Out_cclsCall> >; _Compare = __gnu_cxx::__ops::_Iter_less_iter]' at /usr/include/c++/13/bits/stl_algo.h:1950:31,
    inlined from 'void std::sort(_RAIter, _RAIter) [with _RAIter = __gnu_cxx::__normal_iterator<ccls::{anonymous}::Out_cclsCall*, vector<ccls::{anonymous}::Out_cclsCall> >]' at /usr/include/c++/13/bits/stl_algo.h:4861:18,
    inlined from 'bool ccls::{anonymous}::expand(ccls::MessageHandler*, Out_cclsCall*, bool, CallType, bool, int)' at /<<PKGBUILDDIR>>/src/messages/ccls_call.cc:159:12:
/usr/include/c++/13/bits/stl_algo.h:1859:32: note: parameter passing for argument of type '__gnu_cxx::__normal_iterator<ccls::{anonymous}::Out_cclsCall*, std::vector<ccls::{anonymous}::Out_cclsCall> >' changed in GCC 7.1
 1859 |           std::__insertion_sort(__first, __first + int(_S_threshold), __comp);
      |           ~~~~~~~~~~~~~~~~~~~~~^~~~~~~~~~~~~~~~~~~~~~~~~~~~~~~~~~~~~~~~~~~~~~
/usr/include/c++/13/bits/stl_algo.h:1864:30: note: parameter passing for argument of type '__gnu_cxx::__normal_iterator<ccls::{anonymous}::Out_cclsCall*, std::vector<ccls::{anonymous}::Out_cclsCall> >' changed in GCC 7.1
 1864 |         std::__insertion_sort(__first, __last, __comp);
      |         ~~~~~~~~~~~~~~~~~~~~~^~~~~~~~~~~~~~~~~~~~~~~~~
[ 62%] Building CXX object CMakeFiles/ccls.dir/src/messages/ccls_navigate.cc.o
/usr/bin/c++  -I/<<PKGBUILDDIR>>/src -isystem /<<PKGBUILDDIR>>/third_party -isystem /usr/lib/llvm-16/include -g -O2 -ffile-prefix-map=/<<PKGBUILDDIR>>=. -fstack-protector-strong -fstack-clash-protection -Wformat -Werror=format-security -Wdate-time -D_FORTIFY_SOURCE=2 -std=c++17 -Wall -Wno-sign-compare -Wno-return-type -Wno-unused-result -MD -MT CMakeFiles/ccls.dir/src/messages/ccls_navigate.cc.o -MF CMakeFiles/ccls.dir/src/messages/ccls_navigate.cc.o.d -o CMakeFiles/ccls.dir/src/messages/ccls_navigate.cc.o -c /<<PKGBUILDDIR>>/src/messages/ccls_navigate.cc
[ 65%] Building CXX object CMakeFiles/ccls.dir/src/messages/ccls_reload.cc.o
/usr/bin/c++  -I/<<PKGBUILDDIR>>/src -isystem /<<PKGBUILDDIR>>/third_party -isystem /usr/lib/llvm-16/include -g -O2 -ffile-prefix-map=/<<PKGBUILDDIR>>=. -fstack-protector-strong -fstack-clash-protection -Wformat -Werror=format-security -Wdate-time -D_FORTIFY_SOURCE=2 -std=c++17 -Wall -Wno-sign-compare -Wno-return-type -Wno-unused-result -MD -MT CMakeFiles/ccls.dir/src/messages/ccls_reload.cc.o -MF CMakeFiles/ccls.dir/src/messages/ccls_reload.cc.o.d -o CMakeFiles/ccls.dir/src/messages/ccls_reload.cc.o -c /<<PKGBUILDDIR>>/src/messages/ccls_reload.cc
[ 67%] Building CXX object CMakeFiles/ccls.dir/src/messages/ccls_vars.cc.o
/usr/bin/c++  -I/<<PKGBUILDDIR>>/src -isystem /<<PKGBUILDDIR>>/third_party -isystem /usr/lib/llvm-16/include -g -O2 -ffile-prefix-map=/<<PKGBUILDDIR>>=. -fstack-protector-strong -fstack-clash-protection -Wformat -Werror=format-security -Wdate-time -D_FORTIFY_SOURCE=2 -std=c++17 -Wall -Wno-sign-compare -Wno-return-type -Wno-unused-result -MD -MT CMakeFiles/ccls.dir/src/messages/ccls_vars.cc.o -MF CMakeFiles/ccls.dir/src/messages/ccls_vars.cc.o.d -o CMakeFiles/ccls.dir/src/messages/ccls_vars.cc.o -c /<<PKGBUILDDIR>>/src/messages/ccls_vars.cc
[ 69%] Building CXX object CMakeFiles/ccls.dir/src/messages/initialize.cc.o
/usr/bin/c++  -DCCLS_VERSION=\"0.20230717-1\" -I/<<PKGBUILDDIR>>/src -isystem /<<PKGBUILDDIR>>/third_party -isystem /usr/lib/llvm-16/include -g -O2 -ffile-prefix-map=/<<PKGBUILDDIR>>=. -fstack-protector-strong -fstack-clash-protection -Wformat -Werror=format-security -Wdate-time -D_FORTIFY_SOURCE=2 -std=c++17 -Wall -Wno-sign-compare -Wno-return-type -Wno-unused-result -MD -MT CMakeFiles/ccls.dir/src/messages/initialize.cc.o -MF CMakeFiles/ccls.dir/src/messages/initialize.cc.o.d -o CMakeFiles/ccls.dir/src/messages/initialize.cc.o -c /<<PKGBUILDDIR>>/src/messages/initialize.cc
[ 72%] Building CXX object CMakeFiles/ccls.dir/src/messages/textDocument_code.cc.o
/usr/bin/c++  -I/<<PKGBUILDDIR>>/src -isystem /<<PKGBUILDDIR>>/third_party -isystem /usr/lib/llvm-16/include -g -O2 -ffile-prefix-map=/<<PKGBUILDDIR>>=. -fstack-protector-strong -fstack-clash-protection -Wformat -Werror=format-security -Wdate-time -D_FORTIFY_SOURCE=2 -std=c++17 -Wall -Wno-sign-compare -Wno-return-type -Wno-unused-result -MD -MT CMakeFiles/ccls.dir/src/messages/textDocument_code.cc.o -MF CMakeFiles/ccls.dir/src/messages/textDocument_code.cc.o.d -o CMakeFiles/ccls.dir/src/messages/textDocument_code.cc.o -c /<<PKGBUILDDIR>>/src/messages/textDocument_code.cc
In file included from /usr/include/llvm-16/llvm/Support/FormatVariadic.h:34,
                 from /<<PKGBUILDDIR>>/src/messages/textDocument_code.cc:8:
In static member function 'static size_t llvm::detail::HelperFunctions::consumeNumHexDigits(llvm::StringRef&, llvm::HexPrintStyle, size_t)',
    inlined from 'static void llvm::format_provider<T, typename std::enable_if<llvm::detail::use_integral_formatter<T>::value, void>::type>::format(const T&, llvm::raw_ostream&, llvm::StringRef) [with T = int]' at /usr/include/llvm-16/llvm/Support/FormatProviders.h:135:35:
/usr/include/llvm-16/llvm/Support/FormatProviders.h:95:27: warning: 'HS' may be used uninitialized [-Wmaybe-uninitialized]
   95 |     if (isPrefixedHexStyle(Style))
      |         ~~~~~~~~~~~~~~~~~~^~~~~~~
/usr/include/llvm-16/llvm/Support/FormatProviders.h: In static member function 'static void llvm::format_provider<T, typename std::enable_if<llvm::detail::use_integral_formatter<T>::value, void>::type>::format(const T&, llvm::raw_ostream&, llvm::StringRef) [with T = int]':
/usr/include/llvm-16/llvm/Support/FormatProviders.h:132:19: note: 'HS' was declared here
  132 |     HexPrintStyle HS;
      |                   ^~
[ 74%] Building CXX object CMakeFiles/ccls.dir/src/messages/textDocument_completion.cc.o
/usr/bin/c++  -I/<<PKGBUILDDIR>>/src -isystem /<<PKGBUILDDIR>>/third_party -isystem /usr/lib/llvm-16/include -g -O2 -ffile-prefix-map=/<<PKGBUILDDIR>>=. -fstack-protector-strong -fstack-clash-protection -Wformat -Werror=format-security -Wdate-time -D_FORTIFY_SOURCE=2 -std=c++17 -Wall -Wno-sign-compare -Wno-return-type -Wno-unused-result -MD -MT CMakeFiles/ccls.dir/src/messages/textDocument_completion.cc.o -MF CMakeFiles/ccls.dir/src/messages/textDocument_completion.cc.o.d -o CMakeFiles/ccls.dir/src/messages/textDocument_completion.cc.o -c /<<PKGBUILDDIR>>/src/messages/textDocument_completion.cc
[ 76%] Building CXX object CMakeFiles/ccls.dir/src/messages/textDocument_definition.cc.o
/usr/bin/c++  -I/<<PKGBUILDDIR>>/src -isystem /<<PKGBUILDDIR>>/third_party -isystem /usr/lib/llvm-16/include -g -O2 -ffile-prefix-map=/<<PKGBUILDDIR>>=. -fstack-protector-strong -fstack-clash-protection -Wformat -Werror=format-security -Wdate-time -D_FORTIFY_SOURCE=2 -std=c++17 -Wall -Wno-sign-compare -Wno-return-type -Wno-unused-result -MD -MT CMakeFiles/ccls.dir/src/messages/textDocument_definition.cc.o -MF CMakeFiles/ccls.dir/src/messages/textDocument_definition.cc.o.d -o CMakeFiles/ccls.dir/src/messages/textDocument_definition.cc.o -c /<<PKGBUILDDIR>>/src/messages/textDocument_definition.cc
[ 79%] Building CXX object CMakeFiles/ccls.dir/src/messages/textDocument_did.cc.o
/usr/bin/c++  -I/<<PKGBUILDDIR>>/src -isystem /<<PKGBUILDDIR>>/third_party -isystem /usr/lib/llvm-16/include -g -O2 -ffile-prefix-map=/<<PKGBUILDDIR>>=. -fstack-protector-strong -fstack-clash-protection -Wformat -Werror=format-security -Wdate-time -D_FORTIFY_SOURCE=2 -std=c++17 -Wall -Wno-sign-compare -Wno-return-type -Wno-unused-result -MD -MT CMakeFiles/ccls.dir/src/messages/textDocument_did.cc.o -MF CMakeFiles/ccls.dir/src/messages/textDocument_did.cc.o.d -o CMakeFiles/ccls.dir/src/messages/textDocument_did.cc.o -c /<<PKGBUILDDIR>>/src/messages/textDocument_did.cc
[ 81%] Building CXX object CMakeFiles/ccls.dir/src/messages/textDocument_foldingRange.cc.o
/usr/bin/c++  -I/<<PKGBUILDDIR>>/src -isystem /<<PKGBUILDDIR>>/third_party -isystem /usr/lib/llvm-16/include -g -O2 -ffile-prefix-map=/<<PKGBUILDDIR>>=. -fstack-protector-strong -fstack-clash-protection -Wformat -Werror=format-security -Wdate-time -D_FORTIFY_SOURCE=2 -std=c++17 -Wall -Wno-sign-compare -Wno-return-type -Wno-unused-result -MD -MT CMakeFiles/ccls.dir/src/messages/textDocument_foldingRange.cc.o -MF CMakeFiles/ccls.dir/src/messages/textDocument_foldingRange.cc.o.d -o CMakeFiles/ccls.dir/src/messages/textDocument_foldingRange.cc.o -c /<<PKGBUILDDIR>>/src/messages/textDocument_foldingRange.cc
[ 83%] Building CXX object CMakeFiles/ccls.dir/src/messages/textDocument_formatting.cc.o
/usr/bin/c++  -I/<<PKGBUILDDIR>>/src -isystem /<<PKGBUILDDIR>>/third_party -isystem /usr/lib/llvm-16/include -g -O2 -ffile-prefix-map=/<<PKGBUILDDIR>>=. -fstack-protector-strong -fstack-clash-protection -Wformat -Werror=format-security -Wdate-time -D_FORTIFY_SOURCE=2 -std=c++17 -Wall -Wno-sign-compare -Wno-return-type -Wno-unused-result -MD -MT CMakeFiles/ccls.dir/src/messages/textDocument_formatting.cc.o -MF CMakeFiles/ccls.dir/src/messages/textDocument_formatting.cc.o.d -o CMakeFiles/ccls.dir/src/messages/textDocument_formatting.cc.o -c /<<PKGBUILDDIR>>/src/messages/textDocument_formatting.cc
[ 86%] Building CXX object CMakeFiles/ccls.dir/src/messages/textDocument_document.cc.o
/usr/bin/c++  -I/<<PKGBUILDDIR>>/src -isystem /<<PKGBUILDDIR>>/third_party -isystem /usr/lib/llvm-16/include -g -O2 -ffile-prefix-map=/<<PKGBUILDDIR>>=. -fstack-protector-strong -fstack-clash-protection -Wformat -Werror=format-security -Wdate-time -D_FORTIFY_SOURCE=2 -std=c++17 -Wall -Wno-sign-compare -Wno-return-type -Wno-unused-result -MD -MT CMakeFiles/ccls.dir/src/messages/textDocument_document.cc.o -MF CMakeFiles/ccls.dir/src/messages/textDocument_document.cc.o.d -o CMakeFiles/ccls.dir/src/messages/textDocument_document.cc.o -c /<<PKGBUILDDIR>>/src/messages/textDocument_document.cc
[ 88%] Building CXX object CMakeFiles/ccls.dir/src/messages/textDocument_hover.cc.o
/usr/bin/c++  -I/<<PKGBUILDDIR>>/src -isystem /<<PKGBUILDDIR>>/third_party -isystem /usr/lib/llvm-16/include -g -O2 -ffile-prefix-map=/<<PKGBUILDDIR>>=. -fstack-protector-strong -fstack-clash-protection -Wformat -Werror=format-security -Wdate-time -D_FORTIFY_SOURCE=2 -std=c++17 -Wall -Wno-sign-compare -Wno-return-type -Wno-unused-result -MD -MT CMakeFiles/ccls.dir/src/messages/textDocument_hover.cc.o -MF CMakeFiles/ccls.dir/src/messages/textDocument_hover.cc.o.d -o CMakeFiles/ccls.dir/src/messages/textDocument_hover.cc.o -c /<<PKGBUILDDIR>>/src/messages/textDocument_hover.cc
In file included from /usr/include/c++/13/functional:67,
                 from /<<PKGBUILDDIR>>/src/serializer.hh:14,
                 from /<<PKGBUILDDIR>>/src/config.hh:6,
                 from /<<PKGBUILDDIR>>/src/lsp.hh:6,
                 from /<<PKGBUILDDIR>>/src/message_handler.hh:6,
                 from /<<PKGBUILDDIR>>/src/messages/textDocument_document.cc:4:
/usr/include/c++/13/bits/stl_algo.h: In function 'void std::__unguarded_linear_insert(_RandomAccessIterator, _Compare) [with _RandomAccessIterator = __gnu_cxx::__normal_iterator<ccls::ExtentRef*, vector<ccls::ExtentRef> >; _Compare = __gnu_cxx::__ops::_Val_comp_iter<ccls::MessageHandler::textDocument_documentSymbol(ccls::JsonReader&, ccls::ReplyOnce&)::<lambda(const ccls::ExtentRef&, const ccls::ExtentRef&)> >]':
/usr/include/c++/13/bits/stl_algo.h:1792:5: note: parameter passing for argument of type '__gnu_cxx::__normal_iterator<ccls::ExtentRef*, std::vector<ccls::ExtentRef> >' changed in GCC 7.1
 1792 |     __unguarded_linear_insert(_RandomAccessIterator __last,
      |     ^~~~~~~~~~~~~~~~~~~~~~~~~
/usr/include/c++/13/bits/stl_algo.h: In function 'void std::__insertion_sort(_RandomAccessIterator, _RandomAccessIterator, _Compare) [with _RandomAccessIterator = __gnu_cxx::__normal_iterator<ccls::ExtentRef*, vector<ccls::ExtentRef> >; _Compare = __gnu_cxx::__ops::_Iter_comp_iter<ccls::MessageHandler::textDocument_documentSymbol(ccls::JsonReader&, ccls::ReplyOnce&)::<lambda(const ccls::ExtentRef&, const ccls::ExtentRef&)> >]':
/usr/include/c++/13/bits/stl_algo.h:1812:5: note: parameter passing for argument of type '__gnu_cxx::__normal_iterator<ccls::ExtentRef*, std::vector<ccls::ExtentRef> >' changed in GCC 7.1
 1812 |     __insertion_sort(_RandomAccessIterator __first,
      |     ^~~~~~~~~~~~~~~~
/usr/include/c++/13/bits/stl_algo.h:1812:5: note: parameter passing for argument of type '__gnu_cxx::__normal_iterator<ccls::ExtentRef*, std::vector<ccls::ExtentRef> >' changed in GCC 7.1
In file included from /usr/include/c++/13/bits/stl_algo.h:61:
/usr/include/c++/13/bits/stl_heap.h: In function 'void std::__adjust_heap(_RandomAccessIterator, _Distance, _Distance, _Tp, _Compare) [with _RandomAccessIterator = __gnu_cxx::__normal_iterator<ccls::ExtentRef*, vector<ccls::ExtentRef> >; _Distance = int; _Tp = ccls::ExtentRef; _Compare = __gnu_cxx::__ops::_Iter_comp_iter<ccls::MessageHandler::textDocument_documentSymbol(ccls::JsonReader&, ccls::ReplyOnce&)::<lambda(const ccls::ExtentRef&, const ccls::ExtentRef&)> >]':
/usr/include/c++/13/bits/stl_heap.h:224:5: note: parameter passing for argument of type '__gnu_cxx::__normal_iterator<ccls::ExtentRef*, std::vector<ccls::ExtentRef> >' changed in GCC 7.1
  224 |     __adjust_heap(_RandomAccessIterator __first, _Distance __holeIndex,
      |     ^~~~~~~~~~~~~
/usr/include/c++/13/bits/stl_algo.h: In function 'void std::__introsort_loop(_RandomAccessIterator, _RandomAccessIterator, _Size, _Compare) [with _RandomAccessIterator = __gnu_cxx::__normal_iterator<ccls::ExtentRef*, vector<ccls::ExtentRef> >; _Size = int; _Compare = __gnu_cxx::__ops::_Iter_comp_iter<ccls::MessageHandler::textDocument_documentSymbol(ccls::JsonReader&, ccls::ReplyOnce&)::<lambda(const ccls::ExtentRef&, const ccls::ExtentRef&)> >]':
/usr/include/c++/13/bits/stl_algo.h:1918:5: note: parameter passing for argument of type '__gnu_cxx::__normal_iterator<ccls::ExtentRef*, std::vector<ccls::ExtentRef> >' changed in GCC 7.1
 1918 |     __introsort_loop(_RandomAccessIterator __first,
      |     ^~~~~~~~~~~~~~~~
/usr/include/c++/13/bits/stl_algo.h:1918:5: note: parameter passing for argument of type '__gnu_cxx::__normal_iterator<ccls::ExtentRef*, std::vector<ccls::ExtentRef> >' changed in GCC 7.1
/usr/include/c++/13/bits/stl_algo.h:1932:32: note: parameter passing for argument of type '__gnu_cxx::__normal_iterator<ccls::ExtentRef*, std::vector<ccls::ExtentRef> >' changed in GCC 7.1
 1932 |           std::__introsort_loop(__cut, __last, __depth_limit, __comp);
      |           ~~~~~~~~~~~~~~~~~~~~~^~~~~~~~~~~~~~~~~~~~~~~~~~~~~~~~~~~~~~
In file included from /usr/include/c++/13/vector:72,
                 from /<<PKGBUILDDIR>>/src/utils.hh:13,
                 from /<<PKGBUILDDIR>>/src/serializer.hh:6:
/usr/include/c++/13/bits/vector.tcc: In member function 'void std::vector<_Tp, _Alloc>::_M_realloc_insert(iterator, _Args&& ...) [with _Args = {const ccls::ExtentRef&}; _Tp = ccls::ExtentRef; _Alloc = std::allocator<ccls::ExtentRef>]':
/usr/include/c++/13/bits/vector.tcc:445:7: note: parameter passing for argument of type 'std::vector<ccls::ExtentRef>::iterator' changed in GCC 7.1
  445 |       vector<_Tp, _Alloc>::
      |       ^~~~~~~~~~~~~~~~~~~
In file included from /usr/include/c++/13/vector:66:
In member function 'void std::vector<_Tp, _Alloc>::push_back(const value_type&) [with _Tp = ccls::ExtentRef; _Alloc = std::allocator<ccls::ExtentRef>]',
    inlined from 'void ccls::MessageHandler::textDocument_documentSymbol(ccls::JsonReader&, ccls::ReplyOnce&)' at /<<PKGBUILDDIR>>/src/messages/textDocument_document.cc:162:23:
/usr/include/c++/13/bits/stl_vector.h:1289:28: note: parameter passing for argument of type '__gnu_cxx::__normal_iterator<ccls::ExtentRef*, std::vector<ccls::ExtentRef> >' changed in GCC 7.1
 1289 |           _M_realloc_insert(end(), __x);
      |           ~~~~~~~~~~~~~~~~~^~~~~~~~~~~~
In function 'void std::__sort(_RandomAccessIterator, _RandomAccessIterator, _Compare) [with _RandomAccessIterator = __gnu_cxx::__normal_iterator<ccls::ExtentRef*, vector<ccls::ExtentRef> >; _Compare = __gnu_cxx::__ops::_Iter_comp_iter<ccls::MessageHandler::textDocument_documentSymbol(ccls::JsonReader&, ccls::ReplyOnce&)::<lambda(const ccls::ExtentRef&, const ccls::ExtentRef&)> >]',
    inlined from 'void std::sort(_RAIter, _RAIter, _Compare) [with _RAIter = __gnu_cxx::__normal_iterator<ccls::ExtentRef*, vector<ccls::ExtentRef> >; _Compare = ccls::MessageHandler::textDocument_documentSymbol(ccls::JsonReader&, ccls::ReplyOnce&)::<lambda(const ccls::ExtentRef&, const ccls::ExtentRef&)>]' at /usr/include/c++/13/bits/stl_algo.h:4894:18,
    inlined from 'void ccls::MessageHandler::textDocument_documentSymbol(ccls::JsonReader&, ccls::ReplyOnce&)' at /<<PKGBUILDDIR>>/src/messages/textDocument_document.cc:165:14:
/usr/include/c++/13/bits/stl_algo.h:1947:32: note: parameter passing for argument of type '__gnu_cxx::__normal_iterator<ccls::ExtentRef*, std::vector<ccls::ExtentRef> >' changed in GCC 7.1
 1947 |           std::__introsort_loop(__first, __last,
      |           ~~~~~~~~~~~~~~~~~~~~~^~~~~~~~~~~~~~~~~
 1948 |                                 std::__lg(__last - __first) * 2,
      |                                 ~~~~~~~~~~~~~~~~~~~~~~~~~~~~~~~~
 1949 |                                 __comp);
      |                                 ~~~~~~~
In function 'void std::__final_insertion_sort(_RandomAccessIterator, _RandomAccessIterator, _Compare) [with _RandomAccessIterator = __gnu_cxx::__normal_iterator<ccls::ExtentRef*, vector<ccls::ExtentRef> >; _Compare = __gnu_cxx::__ops::_Iter_comp_iter<ccls::MessageHandler::textDocument_documentSymbol(ccls::JsonReader&, ccls::ReplyOnce&)::<lambda(const ccls::ExtentRef&, const ccls::ExtentRef&)> >]',
    inlined from 'void std::__sort(_RandomAccessIterator, _RandomAccessIterator, _Compare) [with _RandomAccessIterator = __gnu_cxx::__normal_iterator<ccls::ExtentRef*, vector<ccls::ExtentRef> >; _Compare = __gnu_cxx::__ops::_Iter_comp_iter<ccls::MessageHandler::textDocument_documentSymbol(ccls::JsonReader&, ccls::ReplyOnce&)::<lambda(const ccls::ExtentRef&, const ccls::ExtentRef&)> >]' at /usr/include/c++/13/bits/stl_algo.h:1950:31,
    inlined from 'void std::sort(_RAIter, _RAIter, _Compare) [with _RAIter = __gnu_cxx::__normal_iterator<ccls::ExtentRef*, vector<ccls::ExtentRef> >; _Compare = ccls::MessageHandler::textDocument_documentSymbol(ccls::JsonReader&, ccls::ReplyOnce&)::<lambda(const ccls::ExtentRef&, const ccls::ExtentRef&)>]' at /usr/include/c++/13/bits/stl_algo.h:4894:18,
    inlined from 'void ccls::MessageHandler::textDocument_documentSymbol(ccls::JsonReader&, ccls::ReplyOnce&)' at /<<PKGBUILDDIR>>/src/messages/textDocument_document.cc:165:14:
/usr/include/c++/13/bits/stl_algo.h:1859:32: note: parameter passing for argument of type '__gnu_cxx::__normal_iterator<ccls::ExtentRef*, std::vector<ccls::ExtentRef> >' changed in GCC 7.1
 1859 |           std::__insertion_sort(__first, __first + int(_S_threshold), __comp);
      |           ~~~~~~~~~~~~~~~~~~~~~^~~~~~~~~~~~~~~~~~~~~~~~~~~~~~~~~~~~~~~~~~~~~~
/usr/include/c++/13/bits/stl_algo.h:1864:30: note: parameter passing for argument of type '__gnu_cxx::__normal_iterator<ccls::ExtentRef*, std::vector<ccls::ExtentRef> >' changed in GCC 7.1
 1864 |         std::__insertion_sort(__first, __last, __comp);
      |         ~~~~~~~~~~~~~~~~~~~~~^~~~~~~~~~~~~~~~~~~~~~~~~
[ 90%] Building CXX object CMakeFiles/ccls.dir/src/messages/textDocument_references.cc.o
/usr/bin/c++  -I/<<PKGBUILDDIR>>/src -isystem /<<PKGBUILDDIR>>/third_party -isystem /usr/lib/llvm-16/include -g -O2 -ffile-prefix-map=/<<PKGBUILDDIR>>=. -fstack-protector-strong -fstack-clash-protection -Wformat -Werror=format-security -Wdate-time -D_FORTIFY_SOURCE=2 -std=c++17 -Wall -Wno-sign-compare -Wno-return-type -Wno-unused-result -MD -MT CMakeFiles/ccls.dir/src/messages/textDocument_references.cc.o -MF CMakeFiles/ccls.dir/src/messages/textDocument_references.cc.o.d -o CMakeFiles/ccls.dir/src/messages/textDocument_references.cc.o -c /<<PKGBUILDDIR>>/src/messages/textDocument_references.cc
[ 93%] Building CXX object CMakeFiles/ccls.dir/src/messages/textDocument_rename.cc.o
/usr/bin/c++  -I/<<PKGBUILDDIR>>/src -isystem /<<PKGBUILDDIR>>/third_party -isystem /usr/lib/llvm-16/include -g -O2 -ffile-prefix-map=/<<PKGBUILDDIR>>=. -fstack-protector-strong -fstack-clash-protection -Wformat -Werror=format-security -Wdate-time -D_FORTIFY_SOURCE=2 -std=c++17 -Wall -Wno-sign-compare -Wno-return-type -Wno-unused-result -MD -MT CMakeFiles/ccls.dir/src/messages/textDocument_rename.cc.o -MF CMakeFiles/ccls.dir/src/messages/textDocument_rename.cc.o.d -o CMakeFiles/ccls.dir/src/messages/textDocument_rename.cc.o -c /<<PKGBUILDDIR>>/src/messages/textDocument_rename.cc
[ 95%] Building CXX object CMakeFiles/ccls.dir/src/messages/textDocument_signatureHelp.cc.o
/usr/bin/c++  -I/<<PKGBUILDDIR>>/src -isystem /<<PKGBUILDDIR>>/third_party -isystem /usr/lib/llvm-16/include -g -O2 -ffile-prefix-map=/<<PKGBUILDDIR>>=. -fstack-protector-strong -fstack-clash-protection -Wformat -Werror=format-security -Wdate-time -D_FORTIFY_SOURCE=2 -std=c++17 -Wall -Wno-sign-compare -Wno-return-type -Wno-unused-result -MD -MT CMakeFiles/ccls.dir/src/messages/textDocument_signatureHelp.cc.o -MF CMakeFiles/ccls.dir/src/messages/textDocument_signatureHelp.cc.o.d -o CMakeFiles/ccls.dir/src/messages/textDocument_signatureHelp.cc.o -c /<<PKGBUILDDIR>>/src/messages/textDocument_signatureHelp.cc
In file included from /usr/include/c++/13/vector:72,
                 from /<<PKGBUILDDIR>>/src/utils.hh:13,
                 from /<<PKGBUILDDIR>>/src/serializer.hh:6,
                 from /<<PKGBUILDDIR>>/src/config.hh:6,
                 from /<<PKGBUILDDIR>>/src/lsp.hh:6,
                 from /<<PKGBUILDDIR>>/src/message_handler.hh:6,
                 from /<<PKGBUILDDIR>>/src/messages/textDocument_references.cc:4:
/usr/include/c++/13/bits/vector.tcc: In member function 'void std::vector<_Tp, _Alloc>::_M_realloc_insert(iterator, _Args&& ...) [with _Args = {const long long unsigned int&}; _Tp = long long unsigned int; _Alloc = std::allocator<long long unsigned int>]':
/usr/include/c++/13/bits/vector.tcc:445:7: note: parameter passing for argument of type 'std::vector<long long unsigned int, std::allocator<long long unsigned int> >::iterator' changed in GCC 7.1
  445 |       vector<_Tp, _Alloc>::
      |       ^~~~~~~~~~~~~~~~~~~
In file included from /usr/include/c++/13/vector:66:
In member function 'void std::vector<_Tp, _Alloc>::push_back(const value_type&) [with _Tp = long long unsigned int; _Alloc = std::allocator<long long unsigned int>]',
    inlined from 'ccls::MessageHandler::textDocument_references(ccls::JsonReader&, ccls::ReplyOnce&)::<lambda(const auto:31&)> [with auto:31 = ccls::QueryFunc]' at /<<PKGBUILDDIR>>/src/messages/textDocument_references.cc:78:34,
    inlined from 'void ccls::withEntity(DB*, SymbolIdx, Fn&&) [with Fn = MessageHandler::textDocument_references(ccls::JsonReader&, ccls::ReplyOnce&)::<lambda(const auto:31&)>]' at /<<PKGBUILDDIR>>/src/query.hh:225:7,
    inlined from 'void ccls::MessageHandler::textDocument_references(ccls::JsonReader&, ccls::ReplyOnce&)' at /<<PKGBUILDDIR>>/src/messages/textDocument_references.cc:69:17:
/usr/include/c++/13/bits/stl_vector.h:1289:28: note: parameter passing for argument of type '__gnu_cxx::__normal_iterator<long long unsigned int*, std::vector<long long unsigned int, std::allocator<long long unsigned int> > >' changed in GCC 7.1
 1289 |           _M_realloc_insert(end(), __x);
      |           ~~~~~~~~~~~~~~~~~^~~~~~~~~~~~
In member function 'void std::vector<_Tp, _Alloc>::push_back(const value_type&) [with _Tp = long long unsigned int; _Alloc = std::allocator<long long unsigned int>]',
    inlined from 'ccls::MessageHandler::textDocument_references(ccls::JsonReader&, ccls::ReplyOnce&)::<lambda(const auto:31&)> [with auto:31 = ccls::QueryType]' at /<<PKGBUILDDIR>>/src/messages/textDocument_references.cc:78:34,
    inlined from 'void ccls::withEntity(DB*, SymbolIdx, Fn&&) [with Fn = MessageHandler::textDocument_references(ccls::JsonReader&, ccls::ReplyOnce&)::<lambda(const auto:31&)>]' at /<<PKGBUILDDIR>>/src/query.hh:228:7,
    inlined from 'void ccls::MessageHandler::textDocument_references(ccls::JsonReader&, ccls::ReplyOnce&)' at /<<PKGBUILDDIR>>/src/messages/textDocument_references.cc:69:17:
/usr/include/c++/13/bits/stl_vector.h:1289:28: note: parameter passing for argument of type '__gnu_cxx::__normal_iterator<long long unsigned int*, std::vector<long long unsigned int, std::allocator<long long unsigned int> > >' changed in GCC 7.1
 1289 |           _M_realloc_insert(end(), __x);
      |           ~~~~~~~~~~~~~~~~~^~~~~~~~~~~~
[ 97%] Building CXX object CMakeFiles/ccls.dir/src/messages/workspace.cc.o
/usr/bin/c++  -I/<<PKGBUILDDIR>>/src -isystem /<<PKGBUILDDIR>>/third_party -isystem /usr/lib/llvm-16/include -g -O2 -ffile-prefix-map=/<<PKGBUILDDIR>>=. -fstack-protector-strong -fstack-clash-protection -Wformat -Werror=format-security -Wdate-time -D_FORTIFY_SOURCE=2 -std=c++17 -Wall -Wno-sign-compare -Wno-return-type -Wno-unused-result -MD -MT CMakeFiles/ccls.dir/src/messages/workspace.cc.o -MF CMakeFiles/ccls.dir/src/messages/workspace.cc.o.d -o CMakeFiles/ccls.dir/src/messages/workspace.cc.o -c /<<PKGBUILDDIR>>/src/messages/workspace.cc
In file included from /usr/include/c++/13/functional:67,
                 from /<<PKGBUILDDIR>>/src/serializer.hh:14,
                 from /<<PKGBUILDDIR>>/src/config.hh:6,
                 from /<<PKGBUILDDIR>>/src/lsp.hh:6,
                 from /<<PKGBUILDDIR>>/src/message_handler.hh:6,
                 from /<<PKGBUILDDIR>>/src/messages/workspace.cc:6:
/usr/include/c++/13/bits/stl_algo.h: In function 'void std::__unguarded_linear_insert(_RandomAccessIterator, _Compare) [with _RandomAccessIterator = __gnu_cxx::__normal_iterator<tuple<ccls::SymbolInformation, int, ccls::SymbolIdx>*, vector<tuple<ccls::SymbolInformation, int, ccls::SymbolIdx> > >; _Compare = __gnu_cxx::__ops::_Val_comp_iter<ccls::MessageHandler::workspace_symbol(ccls::WorkspaceSymbolParam&, ccls::ReplyOnce&)::<lambda(const auto:37&, const auto:38&)> >]':
/usr/include/c++/13/bits/stl_algo.h:1792:5: note: parameter passing for argument of type '__gnu_cxx::__normal_iterator<std::tuple<ccls::SymbolInformation, int, ccls::SymbolIdx>*, std::vector<std::tuple<ccls::SymbolInformation, int, ccls::SymbolIdx> > >' changed in GCC 7.1
 1792 |     __unguarded_linear_insert(_RandomAccessIterator __last,
      |     ^~~~~~~~~~~~~~~~~~~~~~~~~
/usr/include/c++/13/bits/stl_algo.h: In function 'void std::__insertion_sort(_RandomAccessIterator, _RandomAccessIterator, _Compare) [with _RandomAccessIterator = __gnu_cxx::__normal_iterator<tuple<ccls::SymbolInformation, int, ccls::SymbolIdx>*, vector<tuple<ccls::SymbolInformation, int, ccls::SymbolIdx> > >; _Compare = __gnu_cxx::__ops::_Iter_comp_iter<ccls::MessageHandler::workspace_symbol(ccls::WorkspaceSymbolParam&, ccls::ReplyOnce&)::<lambda(const auto:37&, const auto:38&)> >]':
/usr/include/c++/13/bits/stl_algo.h:1812:5: note: parameter passing for argument of type '__gnu_cxx::__normal_iterator<std::tuple<ccls::SymbolInformation, int, ccls::SymbolIdx>*, std::vector<std::tuple<ccls::SymbolInformation, int, ccls::SymbolIdx> > >' changed in GCC 7.1
 1812 |     __insertion_sort(_RandomAccessIterator __first,
      |     ^~~~~~~~~~~~~~~~
/usr/include/c++/13/bits/stl_algo.h:1812:5: note: parameter passing for argument of type '__gnu_cxx::__normal_iterator<std::tuple<ccls::SymbolInformation, int, ccls::SymbolIdx>*, std::vector<std::tuple<ccls::SymbolInformation, int, ccls::SymbolIdx> > >' changed in GCC 7.1
In file included from /usr/include/c++/13/bits/stl_algo.h:61:
/usr/include/c++/13/bits/stl_heap.h: In function 'void std::__adjust_heap(_RandomAccessIterator, _Distance, _Distance, _Tp, _Compare) [with _RandomAccessIterator = __gnu_cxx::__normal_iterator<tuple<ccls::SymbolInformation, int, ccls::SymbolIdx>*, vector<tuple<ccls::SymbolInformation, int, ccls::SymbolIdx> > >; _Distance = int; _Tp = tuple<ccls::SymbolInformation, int, ccls::SymbolIdx>; _Compare = __gnu_cxx::__ops::_Iter_comp_iter<ccls::MessageHandler::workspace_symbol(ccls::WorkspaceSymbolParam&, ccls::ReplyOnce&)::<lambda(const auto:37&, const auto:38&)> >]':
/usr/include/c++/13/bits/stl_heap.h:224:5: note: parameter passing for argument of type '__gnu_cxx::__normal_iterator<std::tuple<ccls::SymbolInformation, int, ccls::SymbolIdx>*, std::vector<std::tuple<ccls::SymbolInformation, int, ccls::SymbolIdx> > >' changed in GCC 7.1
  224 |     __adjust_heap(_RandomAccessIterator __first, _Distance __holeIndex,
      |     ^~~~~~~~~~~~~
In file included from /usr/include/c++/13/vector:72,
                 from /<<PKGBUILDDIR>>/src/utils.hh:13,
                 from /<<PKGBUILDDIR>>/src/serializer.hh:6:
/usr/include/c++/13/bits/vector.tcc: In member function 'void std::vector<_Tp, _Alloc>::_M_realloc_insert(iterator, _Args&& ...) [with _Args = {ccls::SymbolInformation&, int, ccls::SymbolIdx&}; _Tp = std::tuple<ccls::SymbolInformation, int, ccls::SymbolIdx>; _Alloc = std::allocator<std::tuple<ccls::SymbolInformation, int, ccls::SymbolIdx> >]':
/usr/include/c++/13/bits/vector.tcc:445:7: note: parameter passing for argument of type 'std::vector<std::tuple<ccls::SymbolInformation, int, ccls::SymbolIdx> >::iterator' changed in GCC 7.1
  445 |       vector<_Tp, _Alloc>::
      |       ^~~~~~~~~~~~~~~~~~~
In member function 'std::vector<_Tp, _Alloc>::reference std::vector<_Tp, _Alloc>::emplace_back(_Args&& ...) [with _Args = {ccls::SymbolInformation&, int, ccls::SymbolIdx&}; _Tp = std::tuple<ccls::SymbolInformation, int, ccls::SymbolIdx>; _Alloc = std::allocator<std::tuple<ccls::SymbolInformation, int, ccls::SymbolIdx> >]',
    inlined from 'bool ccls::{anonymous}::addSymbol(ccls::DB*, ccls::WorkingFiles*, const std::vector<unsigned char>&, ccls::SymbolIdx, bool, std::vector<std::tuple<ccls::SymbolInformation, int, ccls::SymbolIdx> >*)' at /<<PKGBUILDDIR>>/src/messages/workspace.cc:141:23:
/usr/include/c++/13/bits/vector.tcc:123:28: note: parameter passing for argument of type '__gnu_cxx::__normal_iterator<std::tuple<ccls::SymbolInformation, int, ccls::SymbolIdx>*, std::vector<std::tuple<ccls::SymbolInformation, int, ccls::SymbolIdx> > >' changed in GCC 7.1
  123 |           _M_realloc_insert(end(), std::forward<_Args>(__args)...);
      |           ~~~~~~~~~~~~~~~~~^~~~~~~~~~~~~~~~~~~~~~~~~~~~~~~~~~~~~~~
/usr/include/c++/13/bits/stl_algo.h: In function 'void std::__introsort_loop(_RandomAccessIterator, _RandomAccessIterator, _Size, _Compare) [with _RandomAccessIterator = __gnu_cxx::__normal_iterator<tuple<ccls::SymbolInformation, int, ccls::SymbolIdx>*, vector<tuple<ccls::SymbolInformation, int, ccls::SymbolIdx> > >; _Size = int; _Compare = __gnu_cxx::__ops::_Iter_comp_iter<ccls::MessageHandler::workspace_symbol(ccls::WorkspaceSymbolParam&, ccls::ReplyOnce&)::<lambda(const auto:37&, const auto:38&)> >]':
/usr/include/c++/13/bits/stl_algo.h:1918:5: note: parameter passing for argument of type '__gnu_cxx::__normal_iterator<std::tuple<ccls::SymbolInformation, int, ccls::SymbolIdx>*, std::vector<std::tuple<ccls::SymbolInformation, int, ccls::SymbolIdx> > >' changed in GCC 7.1
 1918 |     __introsort_loop(_RandomAccessIterator __first,
      |     ^~~~~~~~~~~~~~~~
/usr/include/c++/13/bits/stl_algo.h:1918:5: note: parameter passing for argument of type '__gnu_cxx::__normal_iterator<std::tuple<ccls::SymbolInformation, int, ccls::SymbolIdx>*, std::vector<std::tuple<ccls::SymbolInformation, int, ccls::SymbolIdx> > >' changed in GCC 7.1
/usr/include/c++/13/bits/stl_algo.h:1932:32: note: parameter passing for argument of type '__gnu_cxx::__normal_iterator<std::tuple<ccls::SymbolInformation, int, ccls::SymbolIdx>*, std::vector<std::tuple<ccls::SymbolInformation, int, ccls::SymbolIdx> > >' changed in GCC 7.1
 1932 |           std::__introsort_loop(__cut, __last, __depth_limit, __comp);
      |           ~~~~~~~~~~~~~~~~~~~~~^~~~~~~~~~~~~~~~~~~~~~~~~~~~~~~~~~~~~~
In function 'void std::__sort(_RandomAccessIterator, _RandomAccessIterator, _Compare) [with _RandomAccessIterator = __gnu_cxx::__normal_iterator<tuple<ccls::SymbolInformation, int, ccls::SymbolIdx>*, vector<tuple<ccls::SymbolInformation, int, ccls::SymbolIdx> > >; _Compare = __gnu_cxx::__ops::_Iter_comp_iter<ccls::MessageHandler::workspace_symbol(ccls::WorkspaceSymbolParam&, ccls::ReplyOnce&)::<lambda(const auto:37&, const auto:38&)> >]',
    inlined from 'void std::sort(_RAIter, _RAIter, _Compare) [with _RAIter = __gnu_cxx::__normal_iterator<tuple<ccls::SymbolInformation, int, ccls::SymbolIdx>*, vector<tuple<ccls::SymbolInformation, int, ccls::SymbolIdx> > >; _Compare = ccls::MessageHandler::workspace_symbol(ccls::WorkspaceSymbolParam&, ccls::ReplyOnce&)::<lambda(const auto:37&, const auto:38&)>]' at /usr/include/c++/13/bits/stl_algo.h:4894:18,
    inlined from 'void ccls::MessageHandler::workspace_symbol(ccls::WorkspaceSymbolParam&, ccls::ReplyOnce&)' at /<<PKGBUILDDIR>>/src/messages/workspace.cc:195:14:
/usr/include/c++/13/bits/stl_algo.h:1947:32: note: parameter passing for argument of type '__gnu_cxx::__normal_iterator<std::tuple<ccls::SymbolInformation, int, ccls::SymbolIdx>*, std::vector<std::tuple<ccls::SymbolInformation, int, ccls::SymbolIdx> > >' changed in GCC 7.1
 1947 |           std::__introsort_loop(__first, __last,
      |           ~~~~~~~~~~~~~~~~~~~~~^~~~~~~~~~~~~~~~~
 1948 |                                 std::__lg(__last - __first) * 2,
      |                                 ~~~~~~~~~~~~~~~~~~~~~~~~~~~~~~~~
 1949 |                                 __comp);
      |                                 ~~~~~~~
In function 'void std::__final_insertion_sort(_RandomAccessIterator, _RandomAccessIterator, _Compare) [with _RandomAccessIterator = __gnu_cxx::__normal_iterator<tuple<ccls::SymbolInformation, int, ccls::SymbolIdx>*, vector<tuple<ccls::SymbolInformation, int, ccls::SymbolIdx> > >; _Compare = __gnu_cxx::__ops::_Iter_comp_iter<ccls::MessageHandler::workspace_symbol(ccls::WorkspaceSymbolParam&, ccls::ReplyOnce&)::<lambda(const auto:37&, const auto:38&)> >]',
    inlined from 'void std::__sort(_RandomAccessIterator, _RandomAccessIterator, _Compare) [with _RandomAccessIterator = __gnu_cxx::__normal_iterator<tuple<ccls::SymbolInformation, int, ccls::SymbolIdx>*, vector<tuple<ccls::SymbolInformation, int, ccls::SymbolIdx> > >; _Compare = __gnu_cxx::__ops::_Iter_comp_iter<ccls::MessageHandler::workspace_symbol(ccls::WorkspaceSymbolParam&, ccls::ReplyOnce&)::<lambda(const auto:37&, const auto:38&)> >]' at /usr/include/c++/13/bits/stl_algo.h:1950:31,
    inlined from 'void std::sort(_RAIter, _RAIter, _Compare) [with _RAIter = __gnu_cxx::__normal_iterator<tuple<ccls::SymbolInformation, int, ccls::SymbolIdx>*, vector<tuple<ccls::SymbolInformation, int, ccls::SymbolIdx> > >; _Compare = ccls::MessageHandler::workspace_symbol(ccls::WorkspaceSymbolParam&, ccls::ReplyOnce&)::<lambda(const auto:37&, const auto:38&)>]' at /usr/include/c++/13/bits/stl_algo.h:4894:18,
    inlined from 'void ccls::MessageHandler::workspace_symbol(ccls::WorkspaceSymbolParam&, ccls::ReplyOnce&)' at /<<PKGBUILDDIR>>/src/messages/workspace.cc:195:14:
/usr/include/c++/13/bits/stl_algo.h:1859:32: note: parameter passing for argument of type '__gnu_cxx::__normal_iterator<std::tuple<ccls::SymbolInformation, int, ccls::SymbolIdx>*, std::vector<std::tuple<ccls::SymbolInformation, int, ccls::SymbolIdx> > >' changed in GCC 7.1
 1859 |           std::__insertion_sort(__first, __first + int(_S_threshold), __comp);
      |           ~~~~~~~~~~~~~~~~~~~~~^~~~~~~~~~~~~~~~~~~~~~~~~~~~~~~~~~~~~~~~~~~~~~
/usr/include/c++/13/bits/stl_algo.h:1864:30: note: parameter passing for argument of type '__gnu_cxx::__normal_iterator<std::tuple<ccls::SymbolInformation, int, ccls::SymbolIdx>*, std::vector<std::tuple<ccls::SymbolInformation, int, ccls::SymbolIdx> > >' changed in GCC 7.1
 1864 |         std::__insertion_sort(__first, __last, __comp);
      |         ~~~~~~~~~~~~~~~~~~~~~^~~~~~~~~~~~~~~~~~~~~~~~~
[100%] Linking CXX executable ccls
/usr/bin/cmake -E cmake_link_script CMakeFiles/ccls.dir/link.txt --verbose=1
/usr/bin/c++ -g -O2 -ffile-prefix-map=/<<PKGBUILDDIR>>=. -fstack-protector-strong -fstack-clash-protection -Wformat -Werror=format-security -Wdate-time -D_FORTIFY_SOURCE=2 -Wl,-z,relro -Wl,-z,now CMakeFiles/ccls.dir/third_party/siphash.cc.o CMakeFiles/ccls.dir/src/clang_tu.cc.o CMakeFiles/ccls.dir/src/config.cc.o CMakeFiles/ccls.dir/src/filesystem.cc.o CMakeFiles/ccls.dir/src/fuzzy_match.cc.o CMakeFiles/ccls.dir/src/main.cc.o CMakeFiles/ccls.dir/src/include_complete.cc.o CMakeFiles/ccls.dir/src/indexer.cc.o CMakeFiles/ccls.dir/src/log.cc.o CMakeFiles/ccls.dir/src/lsp.cc.o CMakeFiles/ccls.dir/src/message_handler.cc.o CMakeFiles/ccls.dir/src/pipeline.cc.o CMakeFiles/ccls.dir/src/platform_posix.cc.o CMakeFiles/ccls.dir/src/platform_win.cc.o CMakeFiles/ccls.dir/src/position.cc.o CMakeFiles/ccls.dir/src/project.cc.o CMakeFiles/ccls.dir/src/query.cc.o CMakeFiles/ccls.dir/src/sema_manager.cc.o CMakeFiles/ccls.dir/src/serializer.cc.o CMakeFiles/ccls.dir/src/test.cc.o CMakeFiles/ccls.dir/src/utils.cc.o CMakeFiles/ccls.dir/src/working_files.cc.o CMakeFiles/ccls.dir/src/messages/ccls_call.cc.o CMakeFiles/ccls.dir/src/messages/ccls_info.cc.o CMakeFiles/ccls.dir/src/messages/ccls_inheritance.cc.o CMakeFiles/ccls.dir/src/messages/ccls_member.cc.o CMakeFiles/ccls.dir/src/messages/ccls_navigate.cc.o CMakeFiles/ccls.dir/src/messages/ccls_reload.cc.o CMakeFiles/ccls.dir/src/messages/ccls_vars.cc.o CMakeFiles/ccls.dir/src/messages/initialize.cc.o CMakeFiles/ccls.dir/src/messages/textDocument_code.cc.o CMakeFiles/ccls.dir/src/messages/textDocument_completion.cc.o CMakeFiles/ccls.dir/src/messages/textDocument_definition.cc.o CMakeFiles/ccls.dir/src/messages/textDocument_did.cc.o CMakeFiles/ccls.dir/src/messages/textDocument_foldingRange.cc.o CMakeFiles/ccls.dir/src/messages/textDocument_formatting.cc.o CMakeFiles/ccls.dir/src/messages/textDocument_document.cc.o CMakeFiles/ccls.dir/src/messages/textDocument_hover.cc.o CMakeFiles/ccls.dir/src/messages/textDocument_references.cc.o CMakeFiles/ccls.dir/src/messages/textDocument_rename.cc.o CMakeFiles/ccls.dir/src/messages/textDocument_signatureHelp.cc.o CMakeFiles/ccls.dir/src/messages/workspace.cc.o -o ccls  -Wl,-rpath,/usr/lib/llvm-16/lib: /usr/lib/llvm-16/lib/libclang-cpp.so.16 /usr/lib/llvm-16/lib/libLLVM-16.so.1 
/usr/bin/ld: CMakeFiles/ccls.dir/src/pipeline.cc.o: undefined reference to symbol '__atomic_load_8@@LIBATOMIC_1.0'
/usr/bin/ld: /lib/arm-linux-gnueabihf/libatomic.so.1: error adding symbols: DSO missing from command line
collect2: error: ld returned 1 exit status
make[3]: *** [CMakeFiles/ccls.dir/build.make:758: ccls] Error 1
make[3]: Leaving directory '/<<PKGBUILDDIR>>/obj-arm-linux-gnueabihf'
make[2]: *** [CMakeFiles/Makefile2:91: CMakeFiles/ccls.dir/all] Error 2
make[2]: Leaving directory '/<<PKGBUILDDIR>>/obj-arm-linux-gnueabihf'
make[1]: *** [Makefile:139: all] Error 2
make[1]: Leaving directory '/<<PKGBUILDDIR>>/obj-arm-linux-gnueabihf'
dh_auto_build: error: cd obj-arm-linux-gnueabihf && make -j4 "INSTALL=install --strip-program=true" VERBOSE=1 returned exit code 2
make: *** [debian/rules:15: binary-arch] Error 25
dpkg-buildpackage: error: debian/rules binary-arch subprocess returned exit status 2
--------------------------------------------------------------------------------
Build finished at 2024-02-21T19:05:17Z

Finished
--------


+------------------------------------------------------------------------------+
| Cleanup                                                                      |
+------------------------------------------------------------------------------+

Purging /<<BUILDDIR>>
Not cleaning session: cloned chroot in use
E: Build failure (dpkg-buildpackage died)

+------------------------------------------------------------------------------+
| Summary                                                                      |
+------------------------------------------------------------------------------+

Build Architecture: armhf
Build-Space: 161776
Build-Time: 253
Distribution: trixie-staging
Fail-Stage: build
Host Architecture: armhf
Install-Time: 380
Job: ccls_0.20230717-1
Machine Architecture: armhf
Package: ccls
Package-Time: 651
Source-Version: 0.20230717-1
Space: 161776
Status: attempted
Version: 0.20230717-1
--------------------------------------------------------------------------------
Finished at 2024-02-21T19:05:17Z
Build needed 00:10:51, 161776k disk space