Raspbian Package Auto-Building

Buildd status for ycmd (stretch-staging)

Debian PTSTrackerChangelogBugspackages.d.obuildd.d.o

Package(s): Suite:
Compact mode Co-maintainers

ArchitectureVersionStatusForBuilddStateMiscLogs
Buildd exposure stats armhf  0+20161219+git486b809-2.1Build-Attempted417d 2h 3mbm-wb-03out-of-datemisc:extraold | all (3)

Tail of log for ycmd on armhf:

Traceback (most recent call last):
  File "./run_tests.py", line 227, in <module>
    Main()
  File "./run_tests.py", line 224, in Main
    NoseTests( parsed_args, nosetests_args )
  File "./run_tests.py", line 212, in NoseTests
    subprocess.check_call( [ 'nosetests' ] + nosetests_args )
  File "/usr/lib/python2.7/subprocess.py", line 186, in check_call
    raise CalledProcessError(retcode, cmd)
subprocess.CalledProcessError: Command '[u'nosetests', u'-v', u'--with-id', '--no-byte-compile', '--exclude=^cs$', '--exclude=javascript', '--exclude=rust', '--exclude=go', '--exclude=AddNearestThirdPartyFoldersToSysPath_', '--exclude=GetCompletions_UnicodeInLineFilter_test', '--exclude=FromHandlerWithSubservers_test', '--exclude=FromWatchdogWithSubservers_test']' returned non-zero exit status 1
debian/rules:42: recipe for target 'override_dh_auto_test' failed
make[1]: *** [override_dh_auto_test] Error 1
make[1]: Leaving directory '/<<BUILDDIR>>/ycmd-0+20161219+git486b809'
debian/rules:35: recipe for target 'build-arch' failed
make: *** [build-arch] Error 2