Raspbian Package Auto-Building

Buildd status for xulrunner (wheezy-staging)

Debian PTSTrackerChangelogBugspackages.d.obuildd.d.o

Package(s): Suite:
Compact mode Co-maintainers

ArchitectureVersionStatusForBuilddStateMiscLogs
Buildd exposure stats armhf  24.8.1esr-2~deb7u1Build-Attempted1356d 17h 8mbm-wb-01uncompileddevel:sourceold | all (5)

Tail of log for xulrunner on armhf:

Preprocessed source stored into /tmp/ccaG49nq.out file, please attach this to your bugreport.
make[6]: *** [TestCheckedInt.o] Error 1
make[6]: Leaving directory `/<<PKGBUILDDIR>>/build-xulrunner/mfbt/tests'
make[5]: *** [libs] Error 2
make[5]: Leaving directory `/<<PKGBUILDDIR>>/build-xulrunner/mfbt'
make[4]: *** [libs_tier_base] Error 2
make[4]: Leaving directory `/<<PKGBUILDDIR>>/build-xulrunner'
make[3]: *** [tier_base] Error 2
make[3]: Leaving directory `/<<PKGBUILDDIR>>/build-xulrunner'
make[2]: *** [default] Error 2
make[2]: Leaving directory `/<<PKGBUILDDIR>>/build-xulrunner'
dh_auto_build: make -j4 _LEAKTEST_FILES=leaktest.py JS_READLINE=1 returned exit code 2
make[1]: *** [stamps/build-xulrunner] Error 2
make[1]: Leaving directory `/<<PKGBUILDDIR>>'
make: *** [build] Error 2