Raspbian Package Auto-Building

Buildd status for xhprof (stretch-staging)

Debian PTSTrackerChangelogBugspackages.d.obuildd.d.o

Package(s): Suite:
Compact mode Co-maintainers

ArchitectureVersionStatusForBuilddStateMiscLogs
Buildd exposure stats armhf  0.9.4-2Build-Attempted900d 2h 47mbm-wb-03uncompiledmisc:sourceold | all (30)

Tail of log for xhprof on armhf:

/<<PKGBUILDDIR>>/extension/xhprof.c:24:0: note: this is the location of the previous definition
 # define _GNU_SOURCE
 
/<<PKGBUILDDIR>>/extension/xhprof.c:825:10: warning: 'hp_globals' is static but used in inline function 'hp_ignore_entry' which is not static
   return hp_globals.ignored_function_names != NULL &&
          ^~~~~~~~~~
/<<PKGBUILDDIR>>/extension/xhprof.c: In function 'hp_mode_hier_beginfn_cb':
/<<PKGBUILDDIR>>/extension/xhprof.c:1224:3: error: impossible constraint in 'asm'
   asm volatile("rdtsc" : "=a" (__a), "=d" (__d));
   ^~~
Makefile:180: recipe for target 'xhprof.lo' failed
make[1]: *** [xhprof.lo] Error 1
make[1]: Leaving directory '/<<PKGBUILDDIR>>/extension'
debian/rules:37: recipe for target 'build-stamp' failed
make: *** [build-stamp] Error 2