Raspbian Package Auto-Building

Buildd status for xen (jessie-staging)

Debian PTSTrackerChangelogBugspackages.d.obuildd.d.o

Package(s): Suite:
Compact mode Co-maintainers

ArchitectureVersionStatusForBuilddStateMiscLogs
Buildd exposure stats armhf  4.4.1-9+deb8u10Build-Attempted95d 21h 5mbm-wb-01uncompiledkernel:sourceold | all (1)

Tail of log for xen on armhf:

make[5]: Leaving directory '/<<PKGBUILDDIR>>/debian/build/build-utils_armhf/tools/xenstore'
/<<PKGBUILDDIR>>/debian/build/build-utils_armhf/tools/../tools/Rules.mk:103: recipe for target 'subdir-all-xenstore' failed
make[4]: *** [subdir-all-xenstore] Error 2
make[4]: Leaving directory '/<<PKGBUILDDIR>>/debian/build/build-utils_armhf/tools'
/<<PKGBUILDDIR>>/debian/build/build-utils_armhf/tools/../tools/Rules.mk:98: recipe for target 'subdirs-all' failed
make[3]: *** [subdirs-all] Error 2
make[3]: Leaving directory '/<<PKGBUILDDIR>>/debian/build/build-utils_armhf/tools'
debian/rules.real:102: recipe for target 'debian/stamps/build-utils_armhf' failed
make[2]: *** [debian/stamps/build-utils_armhf] Error 2
make[2]: Leaving directory '/<<PKGBUILDDIR>>'
debian/rules.gen:72: recipe for target 'build-arch_armhf_real' failed
make[1]: *** [build-arch_armhf_real] Error 2
make[1]: Leaving directory '/<<PKGBUILDDIR>>'
debian/rules:20: recipe for target 'build-arch' failed
make: *** [build-arch] Error 2