Raspbian Package Auto-Building

Buildd status for wiredtiger (stretch-staging)

Debian PTSTrackerChangelogBugspackages.d.obuildd.d.o

Package(s): Suite:
Compact mode Co-maintainers

ArchitectureVersionStatusForBuilddStateMiscLogs
Buildd exposure stats armhf  2.6.1+ds-1Build-Attempted907d 1h 58mmb-lxc-01uncompiledmisc:sourceold | all (12)

Tail of log for wiredtiger on armhf:

make[3]: *** Waiting for unfinished jobs....
Makefile:1837: recipe for target 'src/async/async_op.lo' failed
make[3]: *** [src/async/async_op.lo] Error 1
Makefile:1837: recipe for target 'src/async/async_api.lo' failed
make[3]: *** [src/async/async_api.lo] Error 1
make[3]: Leaving directory '/<<BUILDDIR>>/wiredtiger-2.6.1+ds'
Makefile:1997: recipe for target 'all-recursive' failed
make[2]: *** [all-recursive] Error 1
make[2]: Leaving directory '/<<BUILDDIR>>/wiredtiger-2.6.1+ds'
Makefile:921: recipe for target 'all' failed
make[1]: *** [all] Error 2
make[1]: Leaving directory '/<<BUILDDIR>>/wiredtiger-2.6.1+ds'
dh_auto_build: make -j4 returned exit code 2
debian/rules:21: recipe for target 'build-arch' failed
make: *** [build-arch] Error 2