Raspbian Package Auto-Building

Buildd status for wham-align (bullseye-staging)

Debian PTSTrackerChangelogBugspackages.d.obuildd.d.o

Package(s): Suite:
Compact mode Co-maintainers

ArchitectureVersionStatusForBuilddStateMiscLogs
Buildd exposure stats armhf  0.1.5-2Build-Attempted13d 18h 41mtestwandboarduncompiledmisc:sourceold | all (3)

Tail of log for wham-align on armhf:

   25 | static score_mat obj_score_mat = { 1, 1, 1, 1 };
      |                  ^~~~~~~~~~~~~
In file included from main.cpp:38:
edit_distance.h: At global scope:
edit_distance.h:25:18: warning: 'obj_score_mat' defined but not used [-Wunused-variable]
   25 | static score_mat obj_score_mat = { 1, 1, 1, 1 };
      |                  ^~~~~~~~~~~~~
make[1]: *** [makefile:40: hash.o] Error 1
make[1]: *** Waiting for unfinished jobs....
make[1]: *** [makefile:37: embedhash.o] Error 1
make[1]: *** [makefile:46: main.o] Error 1
make[1]: *** [makefile:49: sequence.o] Error 1
make[1]: Leaving directory '/<<PKGBUILDDIR>>'
dh_auto_build: make -j4 "INSTALL=install --strip-program=true" returned exit code 2
make: *** [debian/rules:9: build-arch] Error 255