Raspbian Package Auto-Building

Buildd status for vt (bullseye-staging)

Debian PTSTrackerChangelogBugspackages.d.obuildd.d.o

Package(s): Suite:
Compact mode Co-maintainers

ArchitectureVersionStatusForBuilddStateMiscLogs
Buildd exposure stats armhf  0.57721+ds-2Build-Attempted72d 10h 14mtestbuildduncompiledmisc:sourceold | all (2)

Tail of log for vt on armhf:

testing decompose_blocksub of phased even-length blocks
             output VCF file : ok
             output logs     : ok
++++++++++++++++++++++
Tests for vt decompose
++++++++++++++++++++++
testing decompose for a triallelic variant
             output VCF file : ok
             output logs     : ok

Passed tests : 4 / 5
make[1]: *** [Makefile:164: test] Error 1
make[1]: Leaving directory '/<<BUILDDIR>>/vt-0.57721+ds'
dh_auto_test: error: make -j4 test returned exit code 2
make: *** [debian/rules:8: binary-arch] Error 25