Raspbian Package Auto-Building

Buildd status for vmemcache (bullseye-staging)

Debian PTSTrackerChangelogBugspackages.d.obuildd.d.o

Package(s): Suite:
Compact mode Co-maintainers

ArchitectureVersionStatusForBuilddStateMiscLogs
Buildd exposure stats armhf  0.8-4Build-Attempted15d 11h 35mbm-wb-02uncompiledmisc:extraold | all (4)

Tail of log for vmemcache on armhf:

make[3]: Leaving directory '/<<PKGBUILDDIR>>/obj-arm-linux-gnueabihf'
make[2]: *** [CMakeFiles/Makefile2:525: tests/CMakeFiles/vmemcache_test_mt.dir/all] Error 2
[ 66%] Linking C executable vmemcache_test_basic
cd /<<PKGBUILDDIR>>/obj-arm-linux-gnueabihf/tests && /usr/bin/cmake -E cmake_link_script CMakeFiles/vmemcache_test_basic.dir/link.txt --verbose=1
/usr/bin/cc -g -O2 -fdebug-prefix-map=/<<PKGBUILDDIR>>=. -fstack-protector-strong -Wformat -Werror=format-security -Wall -pedantic -Wdate-time -D_FORTIFY_SOURCE=2 -fno-common -Wall -Wconversion -Wmissing-field-initializers -Wmissing-prototypes -Wpointer-arith -Wsign-compare -Wsign-conversion -Wunused-macros -Werror=incompatible-pointer-types -fdata-sections -ffunction-sections  -Wl,-z,relro -Wl,-z,now -latomic  -Wl,-z,relro -Wl,--warn-common -rdynamic CMakeFiles/vmemcache_test_basic.dir/vmemcache_test_basic.c.o  -o vmemcache_test_basic -Wl,-rpath,/<<PKGBUILDDIR>>/obj-arm-linux-gnueabihf/src ../src/libvmemcache.so.0 
/usr/bin/ld: ../src/libvmemcache.so.0: undefined reference to `__atomic_fetch_add_8'
collect2: error: ld returned 1 exit status
make[3]: *** [tests/CMakeFiles/vmemcache_test_basic.dir/build.make:88: tests/vmemcache_test_basic] Error 1
make[3]: Leaving directory '/<<PKGBUILDDIR>>/obj-arm-linux-gnueabihf'
make[2]: *** [CMakeFiles/Makefile2:562: tests/CMakeFiles/vmemcache_test_basic.dir/all] Error 2
make[2]: Leaving directory '/<<PKGBUILDDIR>>/obj-arm-linux-gnueabihf'
make[1]: *** [Makefile:144: all] Error 2
make[1]: Leaving directory '/<<PKGBUILDDIR>>/obj-arm-linux-gnueabihf'
dh_auto_build: cd obj-arm-linux-gnueabihf && make -j4 "INSTALL=install --strip-program=true" returned exit code 2
make: *** [debian/rules:10: build-arch] Error 255