Raspbian Package Auto-Building

Buildd status for vite (stretch-staging)

Debian PTSTrackerChangelogBugspackages.d.obuildd.d.o

Package(s): Suite:
Compact mode Co-maintainers

ArchitectureVersionStatusForBuilddStateMiscLogs
Buildd exposure stats armhf  1.2+svn1430-5Build-Attempted903d 14h 19mtestwandboardout-of-datedevel:sourceold | all (12)

Tail of log for vite on armhf:

src/CMakeFiles/vite.dir/build.make:1035: recipe for target 'src/CMakeFiles/vite.dir/render/render_stats_opengl.cpp.o' failed
make[4]: *** [src/CMakeFiles/vite.dir/render/render_stats_opengl.cpp.o] Error 1
make[4]: Leaving directory '/<<BUILDDIR>>/vite-1.2+svn1430/obj-arm-linux-gnueabihf'
CMakeFiles/Makefile2:121: recipe for target 'src/CMakeFiles/vite.dir/all' failed
make[3]: *** [src/CMakeFiles/vite.dir/all] Error 2
make[3]: Leaving directory '/<<BUILDDIR>>/vite-1.2+svn1430/obj-arm-linux-gnueabihf'
Makefile:152: recipe for target 'all' failed
make[2]: *** [all] Error 2
make[2]: Leaving directory '/<<BUILDDIR>>/vite-1.2+svn1430/obj-arm-linux-gnueabihf'
dh_auto_build: make -j4 returned exit code 2
debian/rules:11: recipe for target 'override_dh_auto_build' failed
make[1]: *** [override_dh_auto_build] Error 2
make[1]: Leaving directory '/<<BUILDDIR>>/vite-1.2+svn1430'
debian/rules:4: recipe for target 'build-arch' failed
make: *** [build-arch] Error 2