Raspbian Package Auto-Building

Buildd status for valentina (buster-staging)

Debian PTSTrackerChangelogBugspackages.d.obuildd.d.o

Package(s): Suite:
Compact mode Co-maintainers

ArchitectureVersionStatusForBuilddStateMiscLogs
Buildd exposure stats armhf  0.6.1~dfsg-9Build-Attempted166d 1h 44mbm-wb-03uncompiledmisc:extraold | all (16)

Tail of log for valentina on armhf:

PASS   : TST_ValentinaCommandLine::TestOpenCollection(PajamaTopWrap2)
PASS   : TST_ValentinaCommandLine::TestOpenCollection(Keiko_skirt)
PASS   : TST_ValentinaCommandLine::TestOpenCollection(pantalon_base_Eli)
PASS   : TST_ValentinaCommandLine::TestOpenCollection(modell_2)
PASS   : TST_ValentinaCommandLine::TestOpenCollection(IMK_Zhaketa)
PASS   : TST_ValentinaCommandLine::TestOpenCollection(Moulage_0.5_armhole_neckline)
PASS   : TST_ValentinaCommandLine::TestOpenCollection(0.7_Armhole_adjustment_0.10)
PASS   : TST_ValentinaCommandLine::cleanupTestCase()
Totals: 42 passed, 2 failed, 0 skipped, 0 blacklisted, 871802ms
********* Finished testing of TST_ValentinaCommandLine *********
make[2]: *** [Makefile:441: check] Error 2
make[2]: Leaving directory '/<<PKGBUILDDIR>>/src/test/CollectionTest'
make[1]: *** [debian/rules:34: override_dh_auto_test] Error 2
make[1]: Leaving directory '/<<PKGBUILDDIR>>'
make: *** [debian/rules:12: binary-arch] Error 2