Raspbian Package Auto-Building

Buildd status for valentina (bullseye-staging)

Debian PTSTrackerChangelogBugspackages.d.obuildd.d.o

Package(s): Suite:
Compact mode Co-maintainers

ArchitectureVersionStatusForBuilddStateMiscLogs
Buildd exposure stats armhf  0.6.1~dfsg-9Build-Attempted13d 14h 23mmb-lxc-02uncompiledmisc:extraold | all (5)

Tail of log for valentina on armhf:

QWARN  : TST_ValentinaCommandLine::TestOpenCollection(0.7_Armhole_adjustment_0.10) QProcess: Destroyed while process ("/<<PKGBUILDDIR>>/src/test/CollectionTest/bin/../../../app/valentina/bin/valentina") is still running.
FAIL!  : TST_ValentinaCommandLine::TestOpenCollection(0.7_Armhole_adjustment_0.10) 'exit == exitCode' returned FALSE. (The finish operation timed out or an error occurred.
Program: /<<PKGBUILDDIR>>/src/test/CollectionTest/bin/../../../app/valentina/bin/valentina 
Arguments: /<<PKGBUILDDIR>>/src/test/CollectionTest/bin/tst_valentina_collection_tmp/0.7_Armhole_adjustment_0.10.val, --test.
QStandardPaths: XDG_RUNTIME_DIR not set, defaulting to '/tmp/runtime-buildd'
)
   Loc: [tst_valentinacommandline.cpp(296)]
PASS   : TST_ValentinaCommandLine::cleanupTestCase()
Totals: 37 passed, 7 failed, 0 skipped, 0 blacklisted, 2446756ms
********* Finished testing of TST_ValentinaCommandLine *********
make[2]: *** [Makefile:429: check] Error 7
make[2]: Leaving directory '/<<PKGBUILDDIR>>/src/test/CollectionTest'
make[1]: *** [debian/rules:34: override_dh_auto_test] Error 2
make[1]: Leaving directory '/<<PKGBUILDDIR>>'
make: *** [debian/rules:12: binary-arch] Error 2