Raspbian Package Auto-Building

Buildd status for selected packages (bullseye-staging)

Bugs

Package(s): Suite:
Compact mode Co-maintainers

Package armhf
Buildd exposure stats
✔ uvloopInstalled
✘ consul  Build-Attempted
✔ dballeBuild-Attempted
✔ ioappsBuild-Attempted
✔ ivarBuild-Attempted
✔ libbiodBuild-Attempted
✔ libnunc-stansBuild-Attempted
✔ libtangoBuild-Attempted
✔ libxsmmBuild-Attempted
✔ msrtoolBuild-Attempted
✔ qtjsbackend-opensource-srcBuild-Attempted
✔ rust-kvm-ioctlsBuild-Attempted
✔ rust-mysqlclient-sysBuild-Attempted
✔ scanbuttondBuild-Attempted
✔ slang-slirpBuild-Attempted
✔ tlsdateBD-Uninstallable
✔ xf86-video-msmBuild-Attempted
✔ gle-graphicsBD-Uninstallable
✔ vmemcachenot in w-b
Package armhf
Buildd exposure stats
✔ mariadb-connector-odbcBuild-Attempted
✔ fflas-ffpackInstalled
✔ scrappieInstalled
✔ gjh-asl-jsonBuild-Attempted
✔ mesBuild-Attempted
✔ libatomic-queueBD-Uninstallable
✔ libsavitarInstalled
✔ kineticstoolsInstalled
✔ fauccInstalled

Tail of log for consul on armhf:

export GOPATH=/<<BUILDDIR>>/consul-1.8.6+dfsg1/_build \
        && /usr/bin/make GIT_COMMIT=2fa535b GIT_COMMIT_YEAR=2020 -C _build/src/github.com/hashicorp/consul --makefile=/<<BUILDDIR>>/consul-1.8.6+dfsg1/GNUmakefile proto
make[2]: Entering directory '/<<BUILDDIR>>/consul-1.8.6+dfsg1/_build/src/github.com/hashicorp/consul'
bash: line 1: git: command not found
bash: line 1: git: command not found
go list -m: not using modules
Generating proto/pbconnect/connect.proto into proto/pbconnect/connect.pb.go and proto/pbconnect/connect.pb.binary.go
/protobuf: warning: directory does not exist.
--proto_path passed empty directory name.  (Use "." for current directory.)
Failed to generate outputs from proto/pbconnect/connect.proto
make[2]: *** [/<<BUILDDIR>>/consul-1.8.6+dfsg1/GNUmakefile:373: proto/pbconnect/connect.pb.go] Error 1
make[2]: Leaving directory '/<<BUILDDIR>>/consul-1.8.6+dfsg1/_build/src/github.com/hashicorp/consul'
make[1]: *** [debian/rules:64: override_dh_auto_build] Error 2
make[1]: Leaving directory '/<<BUILDDIR>>/consul-1.8.6+dfsg1'
make: *** [debian/rules:36: build-arch] Error 2

Tail of log for dballe on armhf:

OK
2020-12-14 13:23:12,597 INFO test-csv: /usr/bin/python3 /<<PKGBUILDDIR>>/python/test-csv.py: success
2020-12-14 13:23:12,599 INFO runtest: 13 tests requested, 11 succeeded, 2 failed, 0 did not run.
make[5]: *** [Makefile:1033: check-local] Error 1
make[5]: Leaving directory '/<<PKGBUILDDIR>>/python'
make[4]: *** [Makefile:848: check-am] Error 2
make[4]: Leaving directory '/<<PKGBUILDDIR>>/python'
make[3]: *** [Makefile:850: check] Error 2
make[3]: Leaving directory '/<<PKGBUILDDIR>>/python'
make[2]: *** [Makefile:591: check-recursive] Error 1
make[2]: Leaving directory '/<<PKGBUILDDIR>>'
make[1]: *** [Makefile:889: check] Error 2
make[1]: Leaving directory '/<<PKGBUILDDIR>>'
dh_auto_test: error: make -j4 check VERBOSE=1 returned exit code 2
make: *** [debian/rules:7: build-arch] Error 25

Tail of log for ioapps on armhf:

dpkg-buildpackage
-----------------

dpkg-buildpackage: info: source package ioapps
dpkg-buildpackage: info: source version 1.4r2-3
dpkg-buildpackage: info: source distribution unstable
 dpkg-source --before-build .
dpkg-buildpackage: info: host architecture armhf
 fakeroot debian/rules clean
dh clean --with python2
dh: warning: Compatibility levels before 10 are deprecated (level 8 in use)
dh: error: unable to load addon python2: Can't locate Debian/Debhelper/Sequence/python2.pm in @INC (you may need to install the Debian::Debhelper::Sequence::python2 module) (@INC contains: /etc/perl /usr/local/lib/arm-linux-gnueabihf/perl/5.32.0 /usr/local/share/perl/5.32.0 /usr/lib/arm-linux-gnueabihf/perl5/5.32 /usr/share/perl5 /usr/lib/arm-linux-gnueabihf/perl-base /usr/lib/arm-linux-gnueabihf/perl/5.32 /usr/share/perl/5.32 /usr/local/lib/site_perl) at (eval 10) line 1.
BEGIN failed--compilation aborted at (eval 10) line 1.

make: *** [debian/rules:14: clean] Error 25

Tail of log for ivar on armhf:

See tests/test-suite.log
Please report to gkarthik@scripps.edu
============================================================================
make[5]: *** [Makefile:903: test-suite.log] Error 1
make[5]: Leaving directory '/<<BUILDDIR>>/ivar-1.3+dfsg/tests'
make[4]: *** [Makefile:1011: check-TESTS] Error 2
make[4]: Leaving directory '/<<BUILDDIR>>/ivar-1.3+dfsg/tests'
make[3]: *** [Makefile:1204: check-am] Error 2
make[3]: Leaving directory '/<<BUILDDIR>>/ivar-1.3+dfsg/tests'
make[2]: *** [Makefile:360: check-recursive] Error 1
make[2]: Leaving directory '/<<BUILDDIR>>/ivar-1.3+dfsg'
dh_auto_test: error: make -j1 check VERBOSE=1 returned exit code 2
make[1]: *** [debian/rules:12: override_dh_auto_test] Error 25
make[1]: Leaving directory '/<<BUILDDIR>>/ivar-1.3+dfsg'
make: *** [debian/rules:9: binary-arch] Error 2

Tail of log for libbiod on armhf:

gdc: error: unrecognized command-line option ‘-release’; did you mean ‘-frelease’?
gdc: error: unrecognized command-line option ‘-boundscheck=off’; did you mean ‘-fbounds-check=off’?
[3/199] gdc -Ilibbiod.so.0.2.3.p -I. -I.. -Wall -Wdeprecated -g -O2 -fdebug-prefix-map=/<<BUILDDIR>>/libbiod-0.2.3+git20191120.b8eecef=. -fstack-protector-strong -frelease -fPIC -O3 -release -enable-inlining -boundscheck=off -MD -MQ libbiod.so.0.2.3.p/contrib_undead_internal_file.d.o -MF libbiod.so.0.2.3.p/contrib_undead_internal_file.d.o.deps -o libbiod.so.0.2.3.p/contrib_undead_internal_file.d.o -c ../contrib/undead/internal/file.d
FAILED: libbiod.so.0.2.3.p/contrib_undead_internal_file.d.o 
gdc -Ilibbiod.so.0.2.3.p -I. -I.. -Wall -Wdeprecated -g -O2 -fdebug-prefix-map=/<<BUILDDIR>>/libbiod-0.2.3+git20191120.b8eecef=. -fstack-protector-strong -frelease -fPIC -O3 -release -enable-inlining -boundscheck=off -MD -MQ libbiod.so.0.2.3.p/contrib_undead_internal_file.d.o -MF libbiod.so.0.2.3.p/contrib_undead_internal_file.d.o.deps -o libbiod.so.0.2.3.p/contrib_undead_internal_file.d.o -c ../contrib/undead/internal/file.d
gdc: error: unrecognized command-line option ‘-release’; did you mean ‘-frelease’?
gdc: error: unrecognized command-line option ‘-boundscheck=off’; did you mean ‘-fbounds-check=off’?
[4/199] gdc -Ilibbiod.so.0.2.3.p -I. -I.. -Wall -Wdeprecated -g -O2 -fdebug-prefix-map=/<<BUILDDIR>>/libbiod-0.2.3+git20191120.b8eecef=. -fstack-protector-strong -frelease -fPIC -O3 -release -enable-inlining -boundscheck=off -MD -MQ libbiod.so.0.2.3.p/contrib_undead_stream.d.o -MF libbiod.so.0.2.3.p/contrib_undead_stream.d.o.deps -o libbiod.so.0.2.3.p/contrib_undead_stream.d.o -c ../contrib/undead/stream.d
FAILED: libbiod.so.0.2.3.p/contrib_undead_stream.d.o 
gdc -Ilibbiod.so.0.2.3.p -I. -I.. -Wall -Wdeprecated -g -O2 -fdebug-prefix-map=/<<BUILDDIR>>/libbiod-0.2.3+git20191120.b8eecef=. -fstack-protector-strong -frelease -fPIC -O3 -release -enable-inlining -boundscheck=off -MD -MQ libbiod.so.0.2.3.p/contrib_undead_stream.d.o -MF libbiod.so.0.2.3.p/contrib_undead_stream.d.o.deps -o libbiod.so.0.2.3.p/contrib_undead_stream.d.o -c ../contrib/undead/stream.d
gdc: error: unrecognized command-line option ‘-release’; did you mean ‘-frelease’?
gdc: error: unrecognized command-line option ‘-boundscheck=off’; did you mean ‘-fbounds-check=off’?
ninja: build stopped: subcommand failed.
dh_auto_build: error: cd obj-arm-linux-gnueabihf && LC_ALL=C.UTF-8 ninja -j4 -v returned exit code 1
make: *** [debian/rules:7: build-arch] Error 25

Tail of log for libnunc-stans on armhf:

mkdir -p bin
mkdir -p obj
gcc -MM -std=c99 -I"src" -I"inc" src/abstraction/abstraction_dcas.c >obj/abstraction_dcas.d
gcc -g -O2 -fdebug-prefix-map=/<<PKGBUILDDIR>>=. -fstack-protector-strong -Wformat -Werror=format-security  -c -fpic -Wno-unknown-pragmas -std=c99 -I"src" -I"inc"  -o obj/abstraction_dcas.o src/abstraction/abstraction_dcas.c
/tmp/cc8Tldzz.s: Assembler messages:
/tmp/cc8Tldzz.s:74: Error: selected processor does not support `ldrexd r6,r7,[r0]' in ARM mode
/tmp/cc8Tldzz.s:74: Error: selected processor does not support `strexd lr,r2,r3,[r0]' in ARM mode
make[3]: *** [makefile.linux:79: obj/abstraction_dcas.o] Error 1
make[3]: Leaving directory '/<<PKGBUILDDIR>>/liblfds'
make[2]: *** [Makefile:921: all-recursive] Error 1
make[2]: Leaving directory '/<<PKGBUILDDIR>>'
make[1]: *** [Makefile:646: all] Error 2
make[1]: Leaving directory '/<<PKGBUILDDIR>>'
dh_auto_build: error: make -j1 returned exit code 2
make: *** [debian/rules:21: build-arch] Error 25

Tail of log for libtango on armhf:

dpkg-buildpackage: info: host architecture armhf
 fakeroot debian/rules clean
QUILT_PATCHES=debian/patches \
	quilt --quiltrc /dev/null pop -a -R || test $? = 2
No patch removed
rm -rf .pc debian/stamp-patched
dh_testdir
dh_testroot
rm -rf stamps objs
find build -type d -name "objs-*" | xargs rm -rf
rm -f build-stamp-*
dh_clean
dh_clean: warning: Compatibility levels before 10 are deprecated (level 7 in use)
 debian/rules build-arch
make: *** No rule to make target 'build-arch'.  Stop.

Tail of log for libxsmm on armhf:

      |   ^~~~~
In file included from include/libxsmm.h:65,
                 from ./src/libxsmm_gemm_diff.h:34,
                 from ./src/libxsmm_main.c:31:
./src/libxsmm_main.c: In function 'libxsmm_init':
include/libxsmm_sync.h:70:29: warning: implicit declaration of function '__builtin_ia32_pause'; did you mean '__builtin_isspace'? [-Wimplicit-function-declaration]
   70 | # define LIBXSMM_SYNC_PAUSE __builtin_ia32_pause()
      |                             ^~~~~~~~~~~~~~~~~~~~
./src/libxsmm_main.c:719:36: note: in expansion of macro 'LIBXSMM_SYNC_PAUSE'
  719 |       if (0 != once) break; else { LIBXSMM_SYNC_PAUSE; }
      |                                    ^~~~~~~~~~~~~~~~~~
make[1]: *** [Makefile:721: build/intel64/libxsmm_main.o] Error 1
make[1]: Leaving directory '/<<PKGBUILDDIR>>'
dh_auto_build: error: make -j1 returned exit code 2
make: *** [debian/rules:7: build-arch] Error 25

Tail of log for msrtool on armhf:

gcc -g -O2 -fdebug-prefix-map=/<<PKGBUILDDIR>>=. -fstack-protector-strong -Wformat -Werror=format-security -Os -Wall -Werror   -c -o msrutils.o msrutils.c
gcc -g -O2 -fdebug-prefix-map=/<<PKGBUILDDIR>>=. -fstack-protector-strong -Wformat -Werror=format-security -Os -Wall -Werror   -c -o sys.o sys.c
sys.c: In function 'cpuid':
sys.c:40:2: error: unknown register name '%edx' in 'asm'
   40 |  asm ("cpuid" : "=b" (outebx) : "a" (0) : "%ecx", "%edx");
      |  ^~~
sys.c:40:2: error: unknown register name '%ecx' in 'asm'
sys.c:54:2: error: unknown register name '%edx' in 'asm'
   54 |  asm ("cpuid" : "=a" (outeax) : "a" (1) : "%ebx", "%ecx", "%edx");
      |  ^~~
sys.c:54:2: error: unknown register name '%ecx' in 'asm'
sys.c:54:2: error: unknown register name '%ebx' in 'asm'
make[1]: *** [<builtin>: sys.o] Error 1
make[1]: Leaving directory '/<<PKGBUILDDIR>>'
make: *** [/usr/share/cdbs/1/class/makefile.mk:77: debian/stamp-makefile-build] Error 2

Tail of log for qtjsbackend-opensource-src on armhf:

../3rdparty/v8/src/objects.h:7486:36: error: left operand of shift expression '(-8 << 26)' is negative [-fpermissive]
 7486 |       (~kMaxCachedArrayIndexLength << kArrayIndexHashLengthShift) |
      |       ~~~~~~~~~~~~~~~~~~~~~~~~~~~~~^~~~~~~~~~~~~~~~~~~~~~~~~~~~~~
make[3]: *** [Makefile:924: .obj/accessors.o] Error 1
make[3]: *** Waiting for unfinished jobs....
make[3]: *** [Makefile:1362: .obj/ast.o] Error 1
make[3]: *** [Makefile:1244: .obj/assembler.o] Error 1
make[3]: *** [Makefile:1097: .obj/api.o] Error 1
make[3]: Leaving directory '/<<PKGBUILDDIR>>/src/v8'
make[2]: *** [Makefile:91: sub-v8-make_first-ordered] Error 2
make[2]: Leaving directory '/<<PKGBUILDDIR>>/src'
make[1]: *** [Makefile:48: sub-src-make_first] Error 2
make[1]: Leaving directory '/<<PKGBUILDDIR>>'
dh_auto_build: error: make -j4 returned exit code 2
make: *** [debian/rules:14: build-arch] Error 25

Tail of log for rust-kvm-ioctls on armhf:

    |                                                     ^^^^^^^^^^ types differ in mutability
    |
    = note: expected mutable reference `&mut [u8]`
                       found reference `&[u8]`

error: aborting due to 151 previous errors; 4 warnings emitted

Some errors have detailed explanations: E0308, E0412, E0422, E0425, E0432.
For more information about an error, try `rustc --explain E0308`.
error: could not compile `kvm-ioctls`.

Caused by:
  process didn't exit successfully: `CARGO=/usr/bin/cargo CARGO_CRATE_NAME=kvm_ioctls CARGO_MANIFEST_DIR=/<<PKGBUILDDIR>> CARGO_PKG_AUTHORS='Amazon Firecracker Team <firecracker-maintainers@amazon.com>' CARGO_PKG_DESCRIPTION='Safe wrappers over KVM ioctls' CARGO_PKG_HOMEPAGE='' CARGO_PKG_LICENSE='Apache-2.0 OR MIT' CARGO_PKG_LICENSE_FILE='' CARGO_PKG_NAME=kvm-ioctls CARGO_PKG_REPOSITORY='https://github.com/rust-vmm/kvm-ioctls' CARGO_PKG_VERSION=0.2.0 CARGO_PKG_VERSION_MAJOR=0 CARGO_PKG_VERSION_MINOR=2 CARGO_PKG_VERSION_PATCH=0 CARGO_PKG_VERSION_PRE='' LD_LIBRARY_PATH='/<<PKGBUILDDIR>>/target/debug/deps:/usr/lib' rustc --crate-name kvm_ioctls src/lib.rs --error-format=json --json=diagnostic-rendered-ansi --crate-type lib --emit=dep-info,metadata,link -Cembed-bitcode=no -C debuginfo=2 -C metadata=5d8b7c8ab7c457a0 -C extra-filename=-5d8b7c8ab7c457a0 --out-dir /<<PKGBUILDDIR>>/target/arm-unknown-linux-gnueabihf/debug/deps --target arm-unknown-linux-gnueabihf -C incremental=/<<PKGBUILDDIR>>/target/arm-unknown-linux-gnueabihf/debug/incremental -L dependency=/<<PKGBUILDDIR>>/target/arm-unknown-linux-gnueabihf/debug/deps -L dependency=/<<PKGBUILDDIR>>/target/debug/deps --extern kvm_bindings=/<<PKGBUILDDIR>>/target/arm-unknown-linux-gnueabihf/debug/deps/libkvm_bindings-ec9ecfb8a43ddb9c.rmeta --extern libc=/<<PKGBUILDDIR>>/target/arm-unknown-linux-gnueabihf/debug/deps/liblibc-10f03249c9ced5a0.rmeta -C debuginfo=2 --cap-lints warn -C linker=arm-linux-gnueabihf-gcc -C link-arg=-Wl,-z,relro --remap-path-prefix /<<PKGBUILDDIR>>=/usr/share/cargo/registry/kvm-ioctls-0.2.0` (exit code: 1)
dh_auto_test: error: /usr/share/cargo/bin/cargo build returned exit code 101
make: *** [debian/rules:3: build-arch] Error 25

Tail of log for rust-mysqlclient-sys on armhf:

    bindgen_test_layout_st_mysql_res
    bindgen_test_layout_st_mysql_rows
    bindgen_test_layout_st_mysql_stmt
    bindgen_test_layout_st_mysql_time
    bindgen_test_layout_st_net
    bindgen_test_layout_st_plugin_vio
    bindgen_test_layout_st_used_mem

test result: FAILED. 2 passed; 16 failed; 0 ignored; 0 measured; 0 filtered out

error: test failed, to rerun pass '--lib'
dh_auto_test: error: /usr/share/cargo/bin/cargo test --all returned exit code 101
make[1]: *** [debian/rules:6: override_dh_auto_test] Error 25
make[1]: Leaving directory '/<<PKGBUILDDIR>>'
make: *** [debian/rules:3: build-arch] Error 2

Tail of log for scanbuttond on armhf:

dpkg-buildpackage: info: source package scanbuttond
dpkg-buildpackage: info: source version 0.2.3.cvs20090713-16
dpkg-buildpackage: info: source distribution unstable
 dpkg-source --before-build .
dpkg-buildpackage: info: host architecture armhf
 fakeroot debian/rules clean
dh_testdir
set -e; for f in include/scanbuttond/config.h.in INSTALL; do cp "$f" "$f.upstream"; done
if [ -f /usr/share/libtool/config/ltmain.sh ]; then \
  cp /usr/share/libtool/config/ltmain.sh .; \
else \
  cp /usr/share/libtool/ltmain.sh .; \
fi
cp: cannot stat '/usr/share/libtool/ltmain.sh': No such file or directory
make: *** [debian/rules:45: configure-stamp] Error 1

Tail of log for slang-slirp on armhf:

checking for dlfcn.h... yes
checking for dlopen in -ldl... yes
checking for g++... g++
checking whether we are using the GNU C++ compiler... yes
checking whether g++ accepts -g... yes
checking for gfortran... gfortran
checking whether we are using the GNU Fortran compiler... yes
checking whether gfortran accepts -g... yes
checking how to get verbose linking output from gfortran... -v
checking for Fortran libraries of gfortran...  -L/usr/lib/gcc/arm-linux-gnueabihf/10 -L/usr/lib/gcc/arm-linux-gnueabihf/10/../../../arm-linux-gnueabihf -L/usr/lib/gcc/arm-linux-gnueabihf/10/../../.. -L/lib/arm-linux-gnueabihf -L/usr/lib/arm-linux-gnueabihf -lgfortran -lm
checking for dummy main to link with Fortran libraries... none
checking for Fortran name-mangling scheme... lower case, underscore, no extra underscore
checking for the slang library and header files ... no
configure: error: unable to find the slang library and header file slang.h
make: *** [/usr/share/cdbs/1/class/autotools.mk:46: debian/stamp-autotools] Error 1

Dependency installability problem for tlsdate on armhf:

tlsdate build-depends on missing:
- dh-systemd:armhf

Tail of log for xf86-video-msm on armhf:

                 from neon_memsets.c:30:
/usr/include/xorg/servermd.h:51:2: error: #error Drivers must include xorg-server.h before any other xserver headers
   51 | #error Drivers must include xorg-server.h before any other xserver headers
      |  ^~~~~
/usr/include/xorg/servermd.h:52:2: error: #error xserver code must include dix-config.h before any other headers
   52 | #error xserver code must include dix-config.h before any other headers
      |  ^~~~~
make[3]: *** [Makefile:550: neon_memsets.lo] Error 1
make[3]: Leaving directory '/<<BUILDDIR>>/xf86-video-msm-1.0.1+git20100122.5f7df591/src'
make[2]: *** [Makefile:426: all-recursive] Error 1
make[2]: Leaving directory '/<<BUILDDIR>>/xf86-video-msm-1.0.1+git20100122.5f7df591'
make[1]: *** [Makefile:358: all] Error 2
make[1]: Leaving directory '/<<BUILDDIR>>/xf86-video-msm-1.0.1+git20100122.5f7df591'
dh_auto_build: error: make -j1 returned exit code 2
make: *** [debian/rules:8: build-arch] Error 25

Dependency installability problem for gle-graphics on armhf:

gle-graphics build-depends on missing:
- libqt5opengl5-desktop-dev:armhf

Tail of log for mariadb-connector-odbc on armhf:

/usr/bin/cc -g -O2 -fdebug-prefix-map=/<<PKGBUILDDIR>>=. -fstack-protector-strong -Wformat -Werror=format-security -I/usr/include/mariadb -Wdate-time -D_FORTIFY_SOURCE=2 -DCHECK_FUNCTION_EXISTS=floor -Wl,-z,relro  -rdynamic CMakeFiles/cmTC_1343a.dir/CheckFunctionExists.c.o -o cmTC_1343a 
/usr/bin/ld: CMakeFiles/cmTC_1343a.dir/CheckFunctionExists.c.o: in function `main':
/usr/share/cmake-3.18/Modules/CheckFunctionExists.c:17: undefined reference to `floor'
collect2: error: ld returned 1 exit status
gmake[3]: *** [CMakeFiles/cmTC_1343a.dir/build.make:106: cmTC_1343a] Error 1
gmake[3]: Leaving directory '/<<PKGBUILDDIR>>/obj-arm-linux-gnueabihf/CMakeFiles/CMakeTmp'
gmake[2]: *** [Makefile:140: cmTC_1343a/fast] Error 2
gmake[2]: Leaving directory '/<<PKGBUILDDIR>>/obj-arm-linux-gnueabihf/CMakeFiles/CMakeTmp'



dh_auto_configure: error: cd obj-arm-linux-gnueabihf && cmake -DCMAKE_INSTALL_PREFIX=/usr -DCMAKE_BUILD_TYPE=None -DCMAKE_INSTALL_SYSCONFDIR=/etc -DCMAKE_INSTALL_LOCALSTATEDIR=/var -DCMAKE_EXPORT_NO_PACKAGE_REGISTRY=ON -DCMAKE_FIND_PACKAGE_NO_PACKAGE_REGISTRY=ON -DCMAKE_INSTALL_RUNSTATEDIR=/run "-GUnix Makefiles" -DCMAKE_VERBOSE_MAKEFILE=ON -DCMAKE_INSTALL_LIBDIR=lib/arm-linux-gnueabihf -DMARIADB_LINK_DYNAMIC=yes -DINSTALL_LIBDIR=lib/arm-linux-gnueabihf/odbc .. returned exit code 1
make[1]: *** [debian/rules:11: override_dh_auto_configure] Error 25
make[1]: Leaving directory '/<<PKGBUILDDIR>>'
make: *** [debian/rules:8: build-arch] Error 2

Tail of log for gjh-asl-json on armhf:

  280 | #define conval(x,r,ne)  (*((ASL*)asl)->p.Conval)((ASL*)asl,x,r,ne)
      |                                                                ^~
src/AmplInterface.cpp: In member function ‘void AmplInterface::eval_jac_c(const double*, double*) const’:
src/AmplInterface.cpp:920:37: error: invalid conversion from ‘int*’ to ‘fint*’ {aka ‘long int*’} [-fpermissive]
  920 |    jacval((double*)x, jac_c_values, &nerror);
      |                                     ^~~~~~~
      |                                     |
      |                                     int*
/usr/include/ampl-netlib-solvers/asl.h:281:64: note: in definition of macro ‘jacval’
  281 | #define jacval(x,j,ne)  (*((ASL*)asl)->p.Jacval)((ASL*)asl,x,j,ne)
      |                                                                ^~
make[1]: *** [Makefile:25: src/AmplInterface.o] Error 1
make[1]: Leaving directory '/<<BUILDDIR>>/gjh-asl-json-0.0+git20180428.eb8720e'
dh_auto_build: error: make -j4 "INSTALL=install --strip-program=true" returned exit code 2
make: *** [debian/rules:21: binary-arch] Error 25

Tail of log for mes on armhf:

+ trace 'CCLD       lib/linux/arm-mes-gcc/exit-42.S' /usr/bin/gcc -nostdlib -g lib/linux/arm-mes-gcc/exit-42.S -o exit-42
+ shift
+ echo /usr/bin/gcc -nostdlib -g lib/linux/arm-mes-gcc/exit-42.S -o exit-42
+ eval /usr/bin/gcc -nostdlib -g lib/linux/arm-mes-gcc/exit-42.S -o exit-42
++ /usr/bin/gcc -nostdlib -g lib/linux/arm-mes-gcc/exit-42.S -o exit-42
gcc: error: lib/linux/arm-mes-gcc/exit-42.S: No such file or directory
gcc: fatal error: no input files
compilation terminated.
make[2]: *** [GNUmakefile:95: build] Error 1
make[2]: *** Waiting for unfinished jobs....
make[2]: Leaving directory '/<<PKGBUILDDIR>>'
dh_auto_build: error: make -j4 V=2 returned exit code 2
make[1]: *** [debian/rules:23: override_dh_auto_build] Error 25
make[1]: Leaving directory '/<<PKGBUILDDIR>>'
make: *** [debian/rules:17: binary-arch] Error 2

Dependency installability problem for libatomic-queue on armhf:

libatomic-queue build-depends on missing:
- libxenium-dev:armhf (>= 0.0.2+ds-2~)