Raspbian Package Auto-Building

Buildd status for selected packages (bullseye-staging)

Bugs

Package(s): Suite:
Compact mode Co-maintainers

Package armhf
Buildd exposure stats
✘ uvloop  Build-Attempted
✘ consul  Build-Attempted
✔ dballeBuild-Attempted
✔ ioappsBuild-Attempted
✔ ivarBuild-Attempted
✔ kleborateBuild-Attempted
✔ libbiodBuild-Attempted
✔ libnunc-stansBuild-Attempted
✔ libtangoBuild-Attempted
✔ libxsmmBuild-Attempted
✔ mesBuild-Attempted
✔ msrtoolBuild-Attempted
✔ python-parasailBuild-Attempted
✔ qtjsbackend-opensource-srcBuild-Attempted
✔ rust-kvm-ioctlsBuild-Attempted
✔ rust-mysqlclient-sysBuild-Attempted
✔ scanbuttondBuild-Attempted
✔ slang-slirpBuild-Attempted
✔ tlsdateBuild-Attempted
Package armhf
Buildd exposure stats
✔ xf86-video-msmBuild-Attempted
✔ gle-graphicsBuild-Attempted
✔ vmemcacheBuild-Attempted
✔ mariadb-connector-odbcBuild-Attempted
✘ fflas-ffpack  Build-Attempted

Tail of log for uvloop on armhf:

    await asyncio.gather(*coros, loop=self._loop)

-- Docs: https://docs.pytest.org/en/latest/warnings.html
======== 4 failed, 277 passed, 6 skipped, 10 warnings in 193.11 seconds ========
Unhandled error in exception handler
context: {'message': '_GatheringFuture exception was never retrieved', 'exception': CancelledError(), 'future': <_GatheringFuture finished exception=CancelledError()>}
Traceback (most recent call last):
  File "/usr/lib/python3.8/asyncio/base_events.py", line 1744, in call_exception_handler
    self._exception_handler(self, context)
  File "/<<BUILDDIR>>/uvloop-0.14.0+ds1/.pybuild/cpython3_3.8_uvloop/build/uvloop/_testbase.py", line 94, in loop_exception_handler
    self.loop.default_exception_handler(context)
AttributeError: 'NoneType' object has no attribute 'default_exception_handler'
E: pybuild pybuild:352: test: plugin distutils failed with: exit code=1: cd /<<BUILDDIR>>/uvloop-0.14.0+ds1/.pybuild/cpython3_3.8_uvloop/build; python3.8 -m pytest -s tests --ignore=tests/test_pipes.py --ignore=tests/test_sourcecode.py --ignore=tests/test_sockets.py --ignore=tests/test_tcp.py
dh_auto_test: error: pybuild --test --test-pytest -i python{version} -p 3.8 returned exit code 13
make: *** [debian/rules:14: build-arch] Error 25

Tail of log for consul on armhf:

    TestGenerateCert: generate_test.go:101: DM-skipped
--- SKIP: TestGenerateCert (0.00s)
=== CONT  TestGeneratePrivateKey
=== CONT  TestGenerateCA
--- PASS: TestGeneratePrivateKey (0.01s)
--- PASS: TestGenerateCA (0.01s)
PASS
ok  	github.com/hashicorp/consul/tlsutil	1.302s
?   	github.com/hashicorp/consul/types	[no test files]
?   	github.com/hashicorp/consul/version	[no test files]
FAIL
dh_auto_test: error: cd _build && go test -vet=off -v -p 4 -short -failfast -timeout 8m github.com/hashicorp/consul github.com/hashicorp/consul/acl github.com/hashicorp/consul/agent github.com/hashicorp/consul/agent/ae github.com/hashicorp/consul/agent/agentpb github.com/hashicorp/consul/agent/config github.com/hashicorp/consul/agent/debug github.com/hashicorp/consul/agent/exec github.com/hashicorp/consul/agent/local github.com/hashicorp/consul/agent/metadata github.com/hashicorp/consul/agent/mock github.com/hashicorp/consul/agent/pool github.com/hashicorp/consul/agent/router github.com/hashicorp/consul/agent/structs github.com/hashicorp/consul/agent/systemd github.com/hashicorp/consul/agent/token github.com/hashicorp/consul/agent/xds github.com/hashicorp/consul/command github.com/hashicorp/consul/command/acl github.com/hashicorp/consul/command/acl/agenttokens github.com/hashicorp/consul/command/acl/authmethod github.com/hashicorp/consul/command/acl/authmethod/create github.com/hashicorp/consul/command/acl/authmethod/delete github.com/hashicorp/consul/command/acl/authmethod/list github.com/hashicorp/consul/command/acl/authmethod/read github.com/hashicorp/consul/command/acl/authmethod/update github.com/hashicorp/consul/command/acl/bindingrule github.com/hashicorp/consul/command/acl/bindingrule/create github.com/hashicorp/consul/command/acl/bindingrule/delete github.com/hashicorp/consul/command/acl/bindingrule/list github.com/hashicorp/consul/command/acl/bindingrule/read github.com/hashicorp/consul/command/acl/bindingrule/update github.com/hashicorp/consul/command/acl/bootstrap github.com/hashicorp/consul/command/acl/policy github.com/hashicorp/consul/command/acl/policy/create github.com/hashicorp/consul/command/acl/policy/delete github.com/hashicorp/consul/command/acl/policy/list github.com/hashicorp/consul/command/acl/policy/read github.com/hashicorp/consul/command/acl/policy/update github.com/hashicorp/consul/command/acl/role github.com/hashicorp/consul/command/acl/role/create github.com/hashicorp/consul/command/acl/role/delete github.com/hashicorp/consul/command/acl/role/list github.com/hashicorp/consul/command/acl/role/read github.com/hashicorp/consul/command/acl/role/update github.com/hashicorp/consul/command/acl/rules github.com/hashicorp/consul/command/acl/token github.com/hashicorp/consul/command/acl/token/clone github.com/hashicorp/consul/command/acl/token/create github.com/hashicorp/consul/command/acl/token/delete github.com/hashicorp/consul/command/acl/token/list github.com/hashicorp/consul/command/acl/token/read github.com/hashicorp/consul/command/acl/token/update github.com/hashicorp/consul/command/agent github.com/hashicorp/consul/command/catalog github.com/hashicorp/consul/command/catalog/list/dc github.com/hashicorp/consul/command/catalog/list/nodes github.com/hashicorp/consul/command/catalog/list/services github.com/hashicorp/consul/command/config github.com/hashicorp/consul/command/config/delete github.com/hashicorp/consul/command/config/list github.com/hashicorp/consul/command/config/read github.com/hashicorp/consul/command/config/write github.com/hashicorp/consul/command/connect github.com/hashicorp/consul/command/connect/ca github.com/hashicorp/consul/command/connect/ca/get github.com/hashicorp/consul/command/connect/ca/set github.com/hashicorp/consul/command/connect/envoy github.com/hashicorp/consul/command/connect/envoy/pipe-bootstrap github.com/hashicorp/consul/command/connect/proxy github.com/hashicorp/consul/command/event github.com/hashicorp/consul/command/exec github.com/hashicorp/consul/command/flags github.com/hashicorp/consul/command/forceleave github.com/hashicorp/consul/command/helpers github.com/hashicorp/consul/command/info github.com/hashicorp/consul/command/intention github.com/hashicorp/consul/command/intention/check github.com/hashicorp/consul/command/intention/create github.com/hashicorp/consul/command/intention/delete github.com/hashicorp/consul/command/intention/finder github.com/hashicorp/consul/command/intention/get github.com/hashicorp/consul/command/intention/match github.com/hashicorp/consul/command/join github.com/hashicorp/consul/command/keygen github.com/hashicorp/consul/command/keyring github.com/hashicorp/consul/command/kv github.com/hashicorp/consul/command/kv/del github.com/hashicorp/consul/command/kv/exp github.com/hashicorp/consul/command/kv/get github.com/hashicorp/consul/command/kv/imp github.com/hashicorp/consul/command/kv/impexp github.com/hashicorp/consul/command/kv/put github.com/hashicorp/consul/command/leave github.com/hashicorp/consul/command/lock github.com/hashicorp/consul/command/login github.com/hashicorp/consul/command/logout github.com/hashicorp/consul/command/maint github.com/hashicorp/consul/command/members github.com/hashicorp/consul/command/monitor github.com/hashicorp/consul/command/operator github.com/hashicorp/consul/command/operator/autopilot github.com/hashicorp/consul/command/operator/autopilot/get github.com/hashicorp/consul/command/operator/autopilot/set github.com/hashicorp/consul/command/operator/raft github.com/hashicorp/consul/command/operator/raft/listpeers github.com/hashicorp/consul/command/operator/raft/removepeer github.com/hashicorp/consul/command/reload github.com/hashicorp/consul/command/rtt github.com/hashicorp/consul/command/services github.com/hashicorp/consul/command/services/deregister github.com/hashicorp/consul/command/services/register github.com/hashicorp/consul/command/snapshot github.com/hashicorp/consul/command/snapshot/inspect github.com/hashicorp/consul/command/snapshot/restore github.com/hashicorp/consul/command/snapshot/save github.com/hashicorp/consul/command/validate github.com/hashicorp/consul/command/version github.com/hashicorp/consul/command/watch github.com/hashicorp/consul/connect github.com/hashicorp/consul/connect/certgen github.com/hashicorp/consul/connect/proxy github.com/hashicorp/consul/ipaddr github.com/hashicorp/consul/lib github.com/hashicorp/consul/lib/file github.com/hashicorp/consul/lib/semaphore github.com/hashicorp/consul/logging github.com/hashicorp/consul/logging/monitor github.com/hashicorp/consul/sdk/freeport github.com/hashicorp/consul/sdk/testutil github.com/hashicorp/consul/sdk/testutil/retry github.com/hashicorp/consul/sentinel github.com/hashicorp/consul/service_os github.com/hashicorp/consul/snapshot github.com/hashicorp/consul/testrpc github.com/hashicorp/consul/tlsutil github.com/hashicorp/consul/types github.com/hashicorp/consul/version returned exit code 1
make[1]: *** [debian/rules:63: override_dh_auto_test] Error 25
make[1]: Leaving directory '/<<BUILDDIR>>/consul-1.7.4+dfsg1'
make: *** [debian/rules:25: build-arch] Error 2

Tail of log for dballe on armhf:

OK
2020-08-15 04:14:29,805 INFO test-csv: /usr/bin/python3 /<<PKGBUILDDIR>>/python/test-csv.py: success
2020-08-15 04:14:29,807 INFO runtest: 13 tests requested, 11 succeeded, 2 failed, 0 did not run.
make[5]: *** [Makefile:1033: check-local] Error 1
make[5]: Leaving directory '/<<PKGBUILDDIR>>/python'
make[4]: *** [Makefile:848: check-am] Error 2
make[4]: Leaving directory '/<<PKGBUILDDIR>>/python'
make[3]: *** [Makefile:850: check] Error 2
make[3]: Leaving directory '/<<PKGBUILDDIR>>/python'
make[2]: *** [Makefile:591: check-recursive] Error 1
make[2]: Leaving directory '/<<PKGBUILDDIR>>'
make[1]: *** [Makefile:889: check] Error 2
make[1]: Leaving directory '/<<PKGBUILDDIR>>'
dh_auto_test: error: make -j4 check VERBOSE=1 returned exit code 2
make: *** [debian/rules:7: build-arch] Error 25

Tail of log for ioapps on armhf:

      |                                    ^
replicate.c:1397:11: note: 'first_call_orig' was declared here
 1397 |  uint64_t first_call_orig; ///< when was the first original call made
      |           ^~~~~~~~~~~~~~~
replicate.c:104:36: warning: 'last_call_orig' may be used uninitialized in this function [-Wmaybe-uninitialized]
  104 |      diff_orig = CALL_TIME(x##_it) - last_call_orig; \
      |                                    ^
replicate.c:1396:11: note: 'last_call_orig' was declared here
 1396 |  uint64_t last_call_orig; ///< when was the last original call made
      |           ^~~~~~~~~~~~~~
make[2]: *** [Makefile:46: replicate.o] Error 1
make[2]: Leaving directory '/<<PKGBUILDDIR>>'
make[1]: *** [debian/rules:18: override_dh_auto_build] Error 2
make[1]: Leaving directory '/<<PKGBUILDDIR>>'
make: *** [debian/rules:14: build-arch] Error 2

Tail of log for ivar on armhf:

# ERROR: 0
============================================================================
See tests/test-suite.log
Please report to gkarthik@scripps.edu
============================================================================
make[4]: *** [Makefile:826: test-suite.log] Error 1
make[4]: Leaving directory '/<<BUILDDIR>>/ivar-1.2.2+dfsg/tests'
make[3]: *** [Makefile:934: check-TESTS] Error 2
make[3]: Leaving directory '/<<BUILDDIR>>/ivar-1.2.2+dfsg/tests'
make[2]: *** [Makefile:1092: check-am] Error 2
make[2]: Leaving directory '/<<BUILDDIR>>/ivar-1.2.2+dfsg/tests'
make[1]: *** [Makefile:360: check-recursive] Error 1
make[1]: Leaving directory '/<<BUILDDIR>>/ivar-1.2.2+dfsg'
dh_auto_test: error: make -j4 check VERBOSE=1 returned exit code 2
make: *** [debian/rules:9: binary-arch] Error 25

Tail of log for kleborate on armhf:

======================================================================
FAIL: test_salmonella (test.test_species.TestSpecies)
----------------------------------------------------------------------
Traceback (most recent call last):
  File "/<<PKGBUILDDIR>>/.pybuild/cpython3_3.8/build/test/test_species.py", line 95, in test_salmonella
    self.assertTrue('Salmonella' in species)
AssertionError: False is not true

----------------------------------------------------------------------
Ran 123 tests in 477.296s

FAILED (failures=25)
E: pybuild pybuild:352: test: plugin distutils failed with: exit code=1: cd /<<PKGBUILDDIR>>/.pybuild/cpython3_3.8/build; python3.8 -m unittest discover -v 
dh_auto_test: error: pybuild --test -i python{version} -p 3.8 returned exit code 13
make: *** [debian/rules:6: binary-arch] Error 25

Tail of log for libbiod on armhf:

gdc: error: unrecognized command-line option ‘-release’; did you mean ‘-frelease’?
gdc: error: unrecognized command-line option ‘-boundscheck=off’; did you mean ‘-fbounds-check=off’?
[3/199] gdc -Ibiod@sha -I. -I.. -g -O2 -fdebug-prefix-map=/<<BUILDDIR>>/libbiod-0.2.3+git20191120.b8eecef=. -fstack-protector-strong -frelease -fPIC -O3 -release -enable-inlining -boundscheck=off -MD -MQ 'biod@sha/contrib_undead_internal_file.d.o' -MF 'biod@sha/contrib_undead_internal_file.d.o.deps' -o 'biod@sha/contrib_undead_internal_file.d.o' -c ../contrib/undead/internal/file.d
FAILED: biod@sha/contrib_undead_internal_file.d.o 
gdc -Ibiod@sha -I. -I.. -g -O2 -fdebug-prefix-map=/<<BUILDDIR>>/libbiod-0.2.3+git20191120.b8eecef=. -fstack-protector-strong -frelease -fPIC -O3 -release -enable-inlining -boundscheck=off -MD -MQ 'biod@sha/contrib_undead_internal_file.d.o' -MF 'biod@sha/contrib_undead_internal_file.d.o.deps' -o 'biod@sha/contrib_undead_internal_file.d.o' -c ../contrib/undead/internal/file.d
gdc: error: unrecognized command-line option ‘-release’; did you mean ‘-frelease’?
gdc: error: unrecognized command-line option ‘-boundscheck=off’; did you mean ‘-fbounds-check=off’?
[4/199] gdc -Ibiod@sha -I. -I.. -g -O2 -fdebug-prefix-map=/<<BUILDDIR>>/libbiod-0.2.3+git20191120.b8eecef=. -fstack-protector-strong -frelease -fPIC -O3 -release -enable-inlining -boundscheck=off -MD -MQ 'biod@sha/contrib_undead_stream.d.o' -MF 'biod@sha/contrib_undead_stream.d.o.deps' -o 'biod@sha/contrib_undead_stream.d.o' -c ../contrib/undead/stream.d
FAILED: biod@sha/contrib_undead_stream.d.o 
gdc -Ibiod@sha -I. -I.. -g -O2 -fdebug-prefix-map=/<<BUILDDIR>>/libbiod-0.2.3+git20191120.b8eecef=. -fstack-protector-strong -frelease -fPIC -O3 -release -enable-inlining -boundscheck=off -MD -MQ 'biod@sha/contrib_undead_stream.d.o' -MF 'biod@sha/contrib_undead_stream.d.o.deps' -o 'biod@sha/contrib_undead_stream.d.o' -c ../contrib/undead/stream.d
gdc: error: unrecognized command-line option ‘-release’; did you mean ‘-frelease’?
gdc: error: unrecognized command-line option ‘-boundscheck=off’; did you mean ‘-fbounds-check=off’?
ninja: build stopped: subcommand failed.
dh_auto_build: error: cd obj-arm-linux-gnueabihf && LC_ALL=C.UTF-8 ninja -j4 -v returned exit code 1
make: *** [debian/rules:7: build-arch] Error 25

Tail of log for libnunc-stans on armhf:

mkdir -p bin
mkdir -p obj
gcc -MM -std=c99 -I"src" -I"inc" src/abstraction/abstraction_dcas.c >obj/abstraction_dcas.d
gcc -g -O2 -fdebug-prefix-map=/<<PKGBUILDDIR>>=. -fstack-protector-strong -Wformat -Werror=format-security  -c -fpic -Wno-unknown-pragmas -std=c99 -I"src" -I"inc"  -o obj/abstraction_dcas.o src/abstraction/abstraction_dcas.c
/tmp/cchzOwDG.s: Assembler messages:
/tmp/cchzOwDG.s:74: Error: selected processor does not support `ldrexd r6,r7,[r0]' in ARM mode
/tmp/cchzOwDG.s:74: Error: selected processor does not support `strexd lr,r2,r3,[r0]' in ARM mode
make[3]: *** [makefile.linux:79: obj/abstraction_dcas.o] Error 1
make[3]: Leaving directory '/<<PKGBUILDDIR>>/liblfds'
make[2]: *** [Makefile:921: all-recursive] Error 1
make[2]: Leaving directory '/<<PKGBUILDDIR>>'
make[1]: *** [Makefile:646: all] Error 2
make[1]: Leaving directory '/<<PKGBUILDDIR>>'
dh_auto_build: error: make -j1 returned exit code 2
make: *** [debian/rules:21: build-arch] Error 25

Tail of log for libtango on armhf:

dpkg-buildpackage: info: host architecture armhf
 fakeroot debian/rules clean
QUILT_PATCHES=debian/patches \
	quilt --quiltrc /dev/null pop -a -R || test $? = 2
No patch removed
rm -rf .pc debian/stamp-patched
dh_testdir
dh_testroot
rm -rf stamps objs
find build -type d -name "objs-*" | xargs rm -rf
rm -f build-stamp-*
dh_clean
dh_clean: warning: Compatibility levels before 10 are deprecated (level 7 in use)
 debian/rules build-arch
make: *** No rule to make target 'build-arch'.  Stop.

Tail of log for libxsmm on armhf:

      |   ^~~~~
In file included from include/libxsmm.h:65,
                 from ./src/libxsmm_gemm_diff.h:34,
                 from ./src/libxsmm_main.c:31:
./src/libxsmm_main.c: In function 'libxsmm_init':
include/libxsmm_sync.h:70:29: warning: implicit declaration of function '__builtin_ia32_pause'; did you mean '__builtin_isspace'? [-Wimplicit-function-declaration]
   70 | # define LIBXSMM_SYNC_PAUSE __builtin_ia32_pause()
      |                             ^~~~~~~~~~~~~~~~~~~~
./src/libxsmm_main.c:719:36: note: in expansion of macro 'LIBXSMM_SYNC_PAUSE'
  719 |       if (0 != once) break; else { LIBXSMM_SYNC_PAUSE; }
      |                                    ^~~~~~~~~~~~~~~~~~
make[1]: *** [Makefile:721: build/intel64/libxsmm_main.o] Error 1
make[1]: Leaving directory '/<<PKGBUILDDIR>>'
dh_auto_build: error: make -j1 returned exit code 2
make: *** [debian/rules:7: build-arch] Error 25

Tail of log for mes on armhf:

+ trace 'CCLD       lib/linux/arm-mes-gcc/exit-42.S' /usr/bin/gcc -nostdlib -g lib/linux/arm-mes-gcc/exit-42.S -o exit-42
+ shift
+ echo /usr/bin/gcc -nostdlib -g lib/linux/arm-mes-gcc/exit-42.S -o exit-42
+ eval /usr/bin/gcc -nostdlib -g lib/linux/arm-mes-gcc/exit-42.S -o exit-42
++ /usr/bin/gcc -nostdlib -g lib/linux/arm-mes-gcc/exit-42.S -o exit-42
gcc: error: lib/linux/arm-mes-gcc/exit-42.S: No such file or directory
gcc: fatal error: no input files
compilation terminated.
make[2]: *** [GNUmakefile:95: build] Error 1
make[2]: *** Waiting for unfinished jobs....
make[2]: Leaving directory '/<<PKGBUILDDIR>>'
dh_auto_build: error: make -j4 V=2 returned exit code 2
make[1]: *** [debian/rules:23: override_dh_auto_build] Error 25
make[1]: Leaving directory '/<<PKGBUILDDIR>>'
make: *** [debian/rules:17: binary-arch] Error 2

Tail of log for msrtool on armhf:

gcc -g -O2 -fdebug-prefix-map=/<<PKGBUILDDIR>>=. -fstack-protector-strong -Wformat -Werror=format-security -Os -Wall -Werror   -c -o msrutils.o msrutils.c
gcc -g -O2 -fdebug-prefix-map=/<<PKGBUILDDIR>>=. -fstack-protector-strong -Wformat -Werror=format-security -Os -Wall -Werror   -c -o sys.o sys.c
sys.c: In function 'cpuid':
sys.c:40:2: error: unknown register name '%edx' in 'asm'
   40 |  asm ("cpuid" : "=b" (outebx) : "a" (0) : "%ecx", "%edx");
      |  ^~~
sys.c:40:2: error: unknown register name '%ecx' in 'asm'
sys.c:54:2: error: unknown register name '%edx' in 'asm'
   54 |  asm ("cpuid" : "=a" (outeax) : "a" (1) : "%ebx", "%ecx", "%edx");
      |  ^~~
sys.c:54:2: error: unknown register name '%ecx' in 'asm'
sys.c:54:2: error: unknown register name '%ebx' in 'asm'
make[1]: *** [<builtin>: sys.o] Error 1
make[1]: Leaving directory '/<<PKGBUILDDIR>>'
make: *** [/usr/share/cdbs/1/class/makefile.mk:77: debian/stamp-makefile-build] Error 2

Tail of log for python-parasail on armhf:

creating /<<PKGBUILDDIR>>/.pybuild/cpython3_3.8/build/parasail
copying parasail/bindings_v1.py -> /<<PKGBUILDDIR>>/.pybuild/cpython3_3.8/build/parasail
copying parasail/bindings_v2.py -> /<<PKGBUILDDIR>>/.pybuild/cpython3_3.8/build/parasail
copying parasail/__init__.py -> /<<PKGBUILDDIR>>/.pybuild/cpython3_3.8/build/parasail
   dh_auto_test -a -O--buildsystem=pybuild
I: pybuild base:217: cd /<<PKGBUILDDIR>>/.pybuild/cpython3_3.8/build; python3.8 -m pytest tests
============================= test session starts ==============================
platform linux -- Python 3.8.5, pytest-4.6.11, py-1.8.1, pluggy-0.13.0
rootdir: /<<PKGBUILDDIR>>
collected 16 items

tests/test_basic.py ...Segmentation fault
E: pybuild pybuild:352: test: plugin distutils failed with: exit code=139: cd /<<PKGBUILDDIR>>/.pybuild/cpython3_3.8/build; python3.8 -m pytest tests
dh_auto_test: error: pybuild --test --test-pytest -i python{version} -p 3.8 returned exit code 13
make: *** [debian/rules:21: binary-arch] Error 25

Tail of log for qtjsbackend-opensource-src on armhf:

../3rdparty/v8/src/objects.h:7486:36: error: left operand of shift expression '(-8 << 26)' is negative [-fpermissive]
 7486 |       (~kMaxCachedArrayIndexLength << kArrayIndexHashLengthShift) |
      |       ~~~~~~~~~~~~~~~~~~~~~~~~~~~~~^~~~~~~~~~~~~~~~~~~~~~~~~~~~~~
make[3]: *** [Makefile:924: .obj/accessors.o] Error 1
make[3]: *** Waiting for unfinished jobs....
make[3]: *** [Makefile:1362: .obj/ast.o] Error 1
make[3]: *** [Makefile:1244: .obj/assembler.o] Error 1
make[3]: *** [Makefile:1097: .obj/api.o] Error 1
make[3]: Leaving directory '/<<PKGBUILDDIR>>/src/v8'
make[2]: *** [Makefile:91: sub-v8-make_first-ordered] Error 2
make[2]: Leaving directory '/<<PKGBUILDDIR>>/src'
make[1]: *** [Makefile:48: sub-src-make_first] Error 2
make[1]: Leaving directory '/<<PKGBUILDDIR>>'
dh_auto_build: error: make -j4 returned exit code 2
make: *** [debian/rules:14: build-arch] Error 25

Tail of log for rust-kvm-ioctls on armhf:

    |                                                     ^^^^^^^^^^ types differ in mutability
    |
    = note: expected mutable reference `&mut [u8]`
                       found reference `&[u8]`

error: aborting due to 151 previous errors

Some errors have detailed explanations: E0308, E0412, E0422, E0425, E0432.
For more information about an error, try `rustc --explain E0308`.
error: could not compile `kvm-ioctls`.

Caused by:
  process didn't exit successfully: `CARGO_PKG_VERSION_MAJOR=0 LD_LIBRARY_PATH='/<<PKGBUILDDIR>>/target/debug/deps:/usr/lib' CARGO_PKG_NAME=kvm-ioctls CARGO_PKG_HOMEPAGE= CARGO_PKG_REPOSITORY='https://github.com/rust-vmm/kvm-ioctls' CARGO_PKG_AUTHORS='Amazon Firecracker Team <firecracker-maintainers@amazon.com>' CARGO=/usr/bin/cargo CARGO_PKG_VERSION_PATCH=0 CARGO_PKG_VERSION=0.2.0 CARGO_PKG_DESCRIPTION='Safe wrappers over KVM ioctls' CARGO_MANIFEST_DIR=/<<PKGBUILDDIR>> CARGO_PKG_VERSION_PRE= CARGO_PKG_VERSION_MINOR=2 rustc --crate-name kvm_ioctls src/lib.rs --error-format=json --json=diagnostic-rendered-ansi --crate-type lib --emit=dep-info,metadata,link -C debuginfo=2 -C metadata=02fa6815f83dbca5 -C extra-filename=-02fa6815f83dbca5 --out-dir /<<PKGBUILDDIR>>/target/arm-unknown-linux-gnueabihf/debug/deps --target arm-unknown-linux-gnueabihf -C incremental=/<<PKGBUILDDIR>>/target/arm-unknown-linux-gnueabihf/debug/incremental -L dependency=/<<PKGBUILDDIR>>/target/arm-unknown-linux-gnueabihf/debug/deps -L dependency=/<<PKGBUILDDIR>>/target/debug/deps --extern kvm_bindings=/<<PKGBUILDDIR>>/target/arm-unknown-linux-gnueabihf/debug/deps/libkvm_bindings-4990b327b49c44d5.rmeta --extern libc=/<<PKGBUILDDIR>>/target/arm-unknown-linux-gnueabihf/debug/deps/liblibc-26ec46b8e0304423.rmeta -C debuginfo=2 --cap-lints warn -C linker=arm-linux-gnueabihf-gcc -C link-arg=-Wl,-z,relro --remap-path-prefix /<<PKGBUILDDIR>>=/usr/share/cargo/registry/kvm-ioctls-0.2.0` (exit code: 1)
dh_auto_test: error: /usr/share/cargo/bin/cargo build returned exit code 101
make: *** [debian/rules:3: build-arch] Error 25

Tail of log for rust-mysqlclient-sys on armhf:

    bindgen_test_layout_st_mysql_res
    bindgen_test_layout_st_mysql_rows
    bindgen_test_layout_st_mysql_stmt
    bindgen_test_layout_st_mysql_time
    bindgen_test_layout_st_net
    bindgen_test_layout_st_plugin_vio
    bindgen_test_layout_st_used_mem

test result: FAILED. 2 passed; 16 failed; 0 ignored; 0 measured; 0 filtered out

error: test failed, to rerun pass '--lib'
dh_auto_test: error: /usr/share/cargo/bin/cargo test --all returned exit code 101
make[1]: *** [debian/rules:6: override_dh_auto_test] Error 25
make[1]: Leaving directory '/<<PKGBUILDDIR>>'
make: *** [debian/rules:3: build-arch] Error 2

Tail of log for scanbuttond on armhf:

dpkg-buildpackage: info: source package scanbuttond
dpkg-buildpackage: info: source version 0.2.3.cvs20090713-16
dpkg-buildpackage: info: source distribution unstable
 dpkg-source --before-build .
dpkg-buildpackage: info: host architecture armhf
 fakeroot debian/rules clean
dh_testdir
set -e; for f in include/scanbuttond/config.h.in INSTALL; do cp "$f" "$f.upstream"; done
if [ -f /usr/share/libtool/config/ltmain.sh ]; then \
  cp /usr/share/libtool/config/ltmain.sh .; \
else \
  cp /usr/share/libtool/ltmain.sh .; \
fi
cp: cannot stat '/usr/share/libtool/ltmain.sh': No such file or directory
make: *** [debian/rules:45: configure-stamp] Error 1

Tail of log for slang-slirp on armhf:

checking for dlfcn.h... yes
checking for dlopen in -ldl... yes
checking for g++... g++
checking whether we are using the GNU C++ compiler... yes
checking whether g++ accepts -g... yes
checking for gfortran... gfortran
checking whether we are using the GNU Fortran compiler... yes
checking whether gfortran accepts -g... yes
checking how to get verbose linking output from gfortran... -v
checking for Fortran libraries of gfortran...  -L/usr/lib/gcc/arm-linux-gnueabihf/10 -L/usr/lib/gcc/arm-linux-gnueabihf/10/../../../arm-linux-gnueabihf -L/usr/lib/gcc/arm-linux-gnueabihf/10/../../.. -L/lib/arm-linux-gnueabihf -L/usr/lib/arm-linux-gnueabihf -lgfortran -lm
checking for dummy main to link with Fortran libraries... none
checking for Fortran name-mangling scheme... lower case, underscore, no extra underscore
checking for the slang library and header files ... no
configure: error: unable to find the slang library and header file slang.h
make: *** [/usr/share/cdbs/1/class/autotools.mk:46: debian/stamp-autotools] Error 1

Tail of log for tlsdate on armhf:

                 from /usr/include/openssl/bio.h:13,
                 from ./src/tlsdate-helper.h:37,
                 from src/tlsdate-helper.c:78:
/usr/include/openssl/ssl.h:1879:1: note: declared here
 1879 | DEPRECATEDIN_1_1_0(__owur const SSL_METHOD *TLSv1_client_method(void))
      | ^~~~~~~~~~~~~~~~~~
src/tlsdate-helper.c:1207:27: error: invalid use of incomplete typedef 'SSL' {aka 'struct ssl_st'}
 1207 |   memcpy(&result_time, ssl->s3->server_random, sizeof (uint32_t));
      |                           ^~
make[2]: *** [Makefile:2037: src/tlsdate_helper-tlsdate-helper.o] Error 1
make[2]: Leaving directory '/<<PKGBUILDDIR>>'
make[1]: *** [Makefile:1428: all] Error 2
make[1]: Leaving directory '/<<PKGBUILDDIR>>'
dh_auto_build: error: make -j1 returned exit code 2
make: *** [debian/rules:25: build-arch] Error 25

Tail of log for xf86-video-msm on armhf:

                 from neon_memsets.c:30:
/usr/include/xorg/servermd.h:51:2: error: #error Drivers must include xorg-server.h before any other xserver headers
   51 | #error Drivers must include xorg-server.h before any other xserver headers
      |  ^~~~~
/usr/include/xorg/servermd.h:52:2: error: #error xserver code must include dix-config.h before any other headers
   52 | #error xserver code must include dix-config.h before any other headers
      |  ^~~~~
make[3]: *** [Makefile:550: neon_memsets.lo] Error 1
make[3]: Leaving directory '/<<BUILDDIR>>/xf86-video-msm-1.0.1+git20100122.5f7df591/src'
make[2]: *** [Makefile:426: all-recursive] Error 1
make[2]: Leaving directory '/<<BUILDDIR>>/xf86-video-msm-1.0.1+git20100122.5f7df591'
make[1]: *** [Makefile:358: all] Error 2
make[1]: Leaving directory '/<<BUILDDIR>>/xf86-video-msm-1.0.1+git20100122.5f7df591'
dh_auto_build: error: make -j1 returned exit code 2
make: *** [debian/rules:8: build-arch] Error 25

Tail of log for gle-graphics on armhf:

  198 |  glEnd();
      |  ^~~~~
3dviewer.cpp:221:5: error: 'glEndList' was not declared in this scope
  221 |     glEndList();
      |     ^~~~~~~~~
make[4]: *** [Makefile:1860: objects/3dviewer.o] Error 1
make[4]: Leaving directory '/<<PKGBUILDDIR>>/src/gui'
make[3]: *** [MakefileAC:86: domake] Error 2
make[3]: Leaving directory '/<<PKGBUILDDIR>>/src/gui'
make[2]: *** [Makefile:167: make_all] Error 2
make[2]: Leaving directory '/<<PKGBUILDDIR>>'
dh_auto_build: error: make -j1 returned exit code 2
make[1]: *** [debian/rules:42: override_dh_auto_build] Error 25
make[1]: Leaving directory '/<<PKGBUILDDIR>>'
make: *** [debian/rules:38: build-arch] Error 2

Tail of log for vmemcache on armhf:

make[3]: Leaving directory '/<<PKGBUILDDIR>>/obj-arm-linux-gnueabihf'
make[2]: *** [CMakeFiles/Makefile2:598: tests/CMakeFiles/vmemcache_test_mt.dir/all] Error 2
[ 66%] Linking C executable vmemcache_test_basic
cd /<<PKGBUILDDIR>>/obj-arm-linux-gnueabihf/tests && /usr/bin/cmake -E cmake_link_script CMakeFiles/vmemcache_test_basic.dir/link.txt --verbose=1
/usr/bin/cc -g -O2 -fdebug-prefix-map=/<<PKGBUILDDIR>>=. -fstack-protector-strong -Wformat -Werror=format-security -Wall -pedantic -Wdate-time -D_FORTIFY_SOURCE=2 -fno-common -Wall -Wconversion -Wmissing-field-initializers -Wmissing-prototypes -Wpointer-arith -Wsign-compare -Wsign-conversion -Wunused-macros -Werror=incompatible-pointer-types -fdata-sections -ffunction-sections  -Wl,-z,relro -Wl,-z,now -latomic  -Wl,-z,relro -Wl,--warn-common -rdynamic CMakeFiles/vmemcache_test_basic.dir/vmemcache_test_basic.c.o  -o vmemcache_test_basic  -Wl,-rpath,/<<PKGBUILDDIR>>/obj-arm-linux-gnueabihf/src ../src/libvmemcache.so.0 
/usr/bin/ld: ../src/libvmemcache.so.0: undefined reference to `__atomic_fetch_add_8'
collect2: error: ld returned 1 exit status
make[3]: *** [tests/CMakeFiles/vmemcache_test_basic.dir/build.make:88: tests/vmemcache_test_basic] Error 1
make[3]: Leaving directory '/<<PKGBUILDDIR>>/obj-arm-linux-gnueabihf'
make[2]: *** [CMakeFiles/Makefile2:571: tests/CMakeFiles/vmemcache_test_basic.dir/all] Error 2
make[2]: Leaving directory '/<<PKGBUILDDIR>>/obj-arm-linux-gnueabihf'
make[1]: *** [Makefile:144: all] Error 2
make[1]: Leaving directory '/<<PKGBUILDDIR>>/obj-arm-linux-gnueabihf'
dh_auto_build: error: cd obj-arm-linux-gnueabihf && make -j4 "INSTALL=install --strip-program=true" returned exit code 2
make: *** [debian/rules:10: build-arch] Error 25

Tail of log for fflas-ffpack on armhf:

make[5]: *** Deleting file 'test-fsytrf.log'
make[5]: *** [Makefile:1972: test-fsytrf.log] Terminated
make[4]: *** wait: No child processes.  Stop.
make[4]: *** Waiting for unfinished jobs....
make[4]: *** wait: No child processes.  Stop.
make[2]: *** wait: No child processes.  Stop.
make[2]: *** Waiting for unfinished jobs....
make[2]: *** wait: No child processes.  Stop.
E: Caught signal ‘Terminated’: terminating immediately
make[1]: *** wait: No child processes.  Stop.
make[1]: *** Waiting for unfinished jobs....
make[1]: *** wait: No child processes.  Stop.
make[3]: *** [Makefile:2171: check-am] Error 2
Terminated
make: *** [debian/rules:42: binary-arch] Terminated