Raspbian Package Auto-Building

Buildd status for uvloop (bullseye-staging)

Debian PTSTrackerChangelogBugspackages.d.obuildd.d.o

Package(s): Suite:
Compact mode Co-maintainers

ArchitectureVersionStatusForBuilddStateMiscLogs
Buildd exposure stats armhf  0.14.0+ds1-2Build-Attempted73d 19h 38mbm-wb-02out-of-datemisc:optionalold | all (2)

Tail of log for uvloop on armhf:

    await asyncio.gather(*coros, loop=self._loop)

-- Docs: https://docs.pytest.org/en/latest/warnings.html
======== 4 failed, 277 passed, 6 skipped, 10 warnings in 193.11 seconds ========
Unhandled error in exception handler
context: {'message': '_GatheringFuture exception was never retrieved', 'exception': CancelledError(), 'future': <_GatheringFuture finished exception=CancelledError()>}
Traceback (most recent call last):
  File "/usr/lib/python3.8/asyncio/base_events.py", line 1744, in call_exception_handler
    self._exception_handler(self, context)
  File "/<<BUILDDIR>>/uvloop-0.14.0+ds1/.pybuild/cpython3_3.8_uvloop/build/uvloop/_testbase.py", line 94, in loop_exception_handler
    self.loop.default_exception_handler(context)
AttributeError: 'NoneType' object has no attribute 'default_exception_handler'
E: pybuild pybuild:352: test: plugin distutils failed with: exit code=1: cd /<<BUILDDIR>>/uvloop-0.14.0+ds1/.pybuild/cpython3_3.8_uvloop/build; python3.8 -m pytest -s tests --ignore=tests/test_pipes.py --ignore=tests/test_sourcecode.py --ignore=tests/test_sockets.py --ignore=tests/test_tcp.py
dh_auto_test: error: pybuild --test --test-pytest -i python{version} -p 3.8 returned exit code 13
make: *** [debian/rules:14: build-arch] Error 25