Raspbian Package Auto-Building

Buildd status for tulip (bullseye-staging)

Debian PTSTrackerChangelogBugspackages.d.obuildd.d.o

Package(s): Suite:
Compact mode Co-maintainers

ArchitectureVersionStatusForBuilddStateMiscLogs
Buildd exposure stats armhf  4.8.0dfsg-2Build-Attempted8d 1h 30mmb-lxc-01uncompiledgraphics:sourceold | all (5)

Tail of log for tulip on armhf:

      |     ^~~~~~
/<<PKGBUILDDIR>>/thirdparty/OGDF/include/ogdf/basic/DisjointSets.h:195:5: error: there are no arguments to 'memcpy' that depend on a template parameter, so a declaration of 'memcpy' must be available [-fpermissive]
  195 |     memcpy(this->siblings,siblings,sizeof(int)*this->maxNumberOfElements);
      |     ^~~~~~
make[4]: *** [thirdparty/OGDF/CMakeFiles/OGDF-tulip-4.8.dir/build.make:3108: thirdparty/OGDF/CMakeFiles/OGDF-tulip-4.8.dir/src/ogdf/basic/DisjointSets.cpp.o] Error 1
make[4]: *** Waiting for unfinished jobs....
make[4]: Leaving directory '/<<PKGBUILDDIR>>/obj-arm-linux-gnueabihf'
make[3]: *** [CMakeFiles/Makefile2:220: thirdparty/OGDF/CMakeFiles/OGDF-tulip-4.8.dir/all] Error 2
make[3]: Leaving directory '/<<PKGBUILDDIR>>/obj-arm-linux-gnueabihf'
make[2]: *** [Makefile:133: all] Error 2
make[2]: Leaving directory '/<<PKGBUILDDIR>>/obj-arm-linux-gnueabihf'
dh_auto_build: cd obj-arm-linux-gnueabihf && make -j4 returned exit code 2
make[1]: *** [debian/rules:13: override_dh_auto_build-arch] Error 255
make[1]: Leaving directory '/<<PKGBUILDDIR>>'
make: *** [debian/rules:7: build-arch] Error 2