Raspbian Package Auto-Building

Buildd status for trinity (stretch-staging)

Debian PTSTrackerChangelogBugspackages.d.obuildd.d.o

Package(s): Suite:
Compact mode Co-maintainers

ArchitectureVersionStatusForBuilddStateMiscLogs
Buildd exposure stats armhf  1.7-1Build-Attempted902d 17h 54mbm-wb-02out-of-datemisc:sourceold | all (8)

Tail of log for trinity on armhf:

    ^~~~~~~~~~~~~~~~~~~~~~~~
fds/bpf.c:67:4: error: 'BPF_MAP_TYPE_PERCPU_ARRAY' undeclared here (not in a function)
  { BPF_MAP_TYPE_PERCPU_ARRAY, sizeof(u32), sizeof(u64), 100, 0, "percpu array" },
    ^~~~~~~~~~~~~~~~~~~~~~~~~
fds/bpf.c:68:4: error: 'BPF_MAP_TYPE_STACK_TRACE' undeclared here (not in a function)
  { BPF_MAP_TYPE_STACK_TRACE, sizeof(u32), sizeof(u64), 100, 0, "stack trace" },
    ^~~~~~~~~~~~~~~~~~~~~~~~
Makefile:115: recipe for target 'fds/bpf.o' failed
make[2]: *** [fds/bpf.o] Error 1
make[2]: Leaving directory '/<<PKGBUILDDIR>>'
debian/rules:25: recipe for target 'override_dh_auto_build' failed
make[1]: *** [override_dh_auto_build] Error 2
make[1]: Leaving directory '/<<PKGBUILDDIR>>'
debian/rules:27: recipe for target 'build-arch' failed
make: *** [build-arch] Error 2