Raspbian Package Auto-Building

Buildd status for trilinos (buster-staging)

Debian PTSTrackerChangelogBugspackages.d.obuildd.d.o

Package(s): Suite:
Compact mode Co-maintainers

ArchitectureVersionStatusForBuilddStateMiscLogs
Buildd exposure stats armhf  12.12.1-7Build-Attempted166d 4h 39mtestwandboarduncompiledmisc:sourceold | all (17)

Tail of log for trilinos on armhf:

[  0%] Built target TeuchosParameterList_BadXmlTestFiles
[  0%] Built target TeuchosParameterList_CopyExampleXmlFiles
[  0%] Linking CXX shared library libtrilinos_kokkos_gtest.so
cd /<<PKGBUILDDIR>>/obj-arm-linux-gnueabihf/packages/kokkos/core/unit_test && /usr/bin/cmake -E cmake_link_script CMakeFiles/trilinos_kokkos_gtest.dir/link.txt --verbose=1
/usr/bin/mpicxx -fPIC   -g -O2 -fdebug-prefix-map=/<<PKGBUILDDIR>>=. -fstack-protector-strong -Wformat -Werror=format-security -Wdate-time -D_FORTIFY_SOURCE=2 -std=c++11 -Wl,-z,relro -Wl,-z,now -Wl,--as-needed -shared -Wl,-soname,libtrilinos_kokkos_gtest.so.12 -o libtrilinos_kokkos_gtest.so.12.12.1 CMakeFiles/trilinos_kokkos_gtest.dir/__/__/tpls/gtest/gtest/gtest-all.cc.o /usr/lib/arm-linux-gnueabihf/libdl.so 
cd /<<PKGBUILDDIR>>/obj-arm-linux-gnueabihf/packages/kokkos/core/unit_test && /usr/bin/cmake -E cmake_symlink_library libtrilinos_kokkos_gtest.so.12.12.1 libtrilinos_kokkos_gtest.so.12 libtrilinos_kokkos_gtest.so
make[4]: Leaving directory '/<<PKGBUILDDIR>>/obj-arm-linux-gnueabihf'
[  0%] Built target trilinos_kokkos_gtest
make[3]: Leaving directory '/<<PKGBUILDDIR>>/obj-arm-linux-gnueabihf'
make[2]: *** [Makefile:166: all] Error 2
make[2]: Leaving directory '/<<PKGBUILDDIR>>/obj-arm-linux-gnueabihf'
dh_auto_build: cd obj-arm-linux-gnueabihf && make -j4 "INSTALL=install --strip-program=true" returned exit code 2
make[1]: *** [debian/rules:81: override_dh_auto_build-arch] Error 2
make[1]: Leaving directory '/<<PKGBUILDDIR>>'
make: *** [debian/rules:70: build-arch] Error 2