Raspbian Package Auto-Building

Buildd status for tnseq-transit (bullseye-staging)

Debian PTSTrackerChangelogBugspackages.d.obuildd.d.o

Package(s): Suite:
Compact mode Co-maintainers

ArchitectureVersionStatusForBuilddStateMiscLogs
Buildd exposure stats armhf  3.1.0-2Build-Attempted59d 20h 11mbm-wb-03out-of-datemisc:optionalold | all (1)

Tail of log for tnseq-transit on armhf:

# read_length: 125 bp
# mean_R1_genomic_length: 121.6 bp
Removing tpp test file
Removing tpp test file
Removing tpp test file
Removing tpp test file
Removing tpp test file
Removing tpp test file
Removing tpp test file
Removing tpp test file
E: pybuild pybuild:352: test: plugin custom failed with: exit code=1: PYTHONPATH=tests python3.8 -m unittest -v tests/*.py
dh_auto_test: error: pybuild --test -i python{version} -p 3.8 --system=custom "--test-args=PYTHONPATH=tests {interpreter} -m unittest -v tests/*.py" returned exit code 13
make[1]: *** [debian/rules:23: override_dh_auto_test] Error 25
make[1]: Leaving directory '/<<PKGBUILDDIR>>'
make: *** [debian/rules:9: binary-arch] Error 2