Raspbian Package Auto-Building

Buildd status for tlsdate (stretch-staging)

Debian PTSTrackerChangelogBugspackages.d.obuildd.d.o

Package(s): Suite:
Compact mode Co-maintainers

ArchitectureVersionStatusForBuilddStateMiscLogs
Buildd exposure stats armhf  0.0.13-1Build-Attempted902d 4mmb-lxc-01uncompiledmisc:sourceold | all (19)

Tail of log for tlsdate on armhf:

/usr/include/openssl/ssl.h:1614:1: note: declared here
 DEPRECATEDIN_1_1_0(__owur const SSL_METHOD *TLSv1_client_method(void)) /* TLSv1.0 */
 ^
src/tlsdate-helper.c:1207:27: error: dereferencing pointer to incomplete type 'SSL {aka struct ssl_st}'
   memcpy(&result_time, ssl->s3->server_random, sizeof (uint32_t));
                           ^~
Makefile:1973: recipe for target 'src/src_tlsdate_helper-tlsdate-helper.o' failed
make[2]: *** [src/src_tlsdate_helper-tlsdate-helper.o] Error 1
make[2]: Leaving directory '/<<PKGBUILDDIR>>'
Makefile:1367: recipe for target 'all' failed
make[1]: *** [all] Error 2
make[1]: Leaving directory '/<<PKGBUILDDIR>>'
dh_auto_build: make -j1 returned exit code 2
debian/rules:25: recipe for target 'build-arch' failed
make: *** [build-arch] Error 2