Raspbian Package Auto-Building

Buildd status for tlsdate (bullseye-staging)

Debian PTSTrackerChangelogBugspackages.d.obuildd.d.o

Package(s): Suite:
Compact mode Co-maintainers

ArchitectureVersionStatusForBuilddStateMiscLogs
Buildd exposure stats armhf  0.0.13-1Build-Attempted10d 8h 38mbm-wb-04uncompiledmisc:sourceold | all (5)

Tail of log for tlsdate on armhf:

                 from /usr/include/openssl/bio.h:13,
                 from ./src/tlsdate-helper.h:37,
                 from src/tlsdate-helper.c:78:
/usr/include/openssl/ssl.h:1879:1: note: declared here
 1879 | DEPRECATEDIN_1_1_0(__owur const SSL_METHOD *TLSv1_client_method(void))
      | ^~~~~~~~~~~~~~~~~~
src/tlsdate-helper.c:1207:27: error: dereferencing pointer to incomplete type 'SSL' {aka 'struct ssl_st'}
 1207 |   memcpy(&result_time, ssl->s3->server_random, sizeof (uint32_t));
      |                           ^~
make[2]: *** [Makefile:2037: src/tlsdate_helper-tlsdate-helper.o] Error 1
make[2]: Leaving directory '/<<PKGBUILDDIR>>'
make[1]: *** [Makefile:1428: all] Error 2
make[1]: Leaving directory '/<<PKGBUILDDIR>>'
dh_auto_build: make -j1 returned exit code 2
make: *** [debian/rules:25: build-arch] Error 255