Raspbian Package Auto-Building

Buildd status for tiledarray, acl2, varnish-agent, colmap (buster-staging)

Bugs

Package(s): Suite:
Compact mode Co-maintainers

Package armhf
Buildd exposure stats
✘ tiledarray  Build-Attempted
✘ acl2  Build-Attempted
✔ varnish-agentBuild-Attempted
✔ colmapBuild-Attempted

Tail of log for tiledarray on armhf:

    #include <Eigen/Core>
    #include <Eigen/Dense>
    #include <iostream>
    int main(int argc, char* argv[]){
      Eigen::MatrixXd m = Eigen::MatrixXd::Random(5, 5);
      m = m.transpose() + m;
      Eigen::SelfAdjointEigenSolver<Eigen::MatrixXd> eig(m);
      Eigen::MatrixXd m_invsqrt = eig.operatorInverseSqrt();
      std::cout << m_invsqrt << std::endl;
    }
dh_auto_configure: cd obj-arm-linux-gnueabihf && cmake -DCMAKE_INSTALL_PREFIX=/usr -DCMAKE_BUILD_TYPE=None -DCMAKE_INSTALL_SYSCONFDIR=/etc -DCMAKE_INSTALL_LOCALSTATEDIR=/var -DCMAKE_EXPORT_NO_PACKAGE_REGISTRY=ON -DCMAKE_FIND_PACKAGE_NO_PACKAGE_REGISTRY=ON "-GUnix Makefiles" -DCMAKE_VERBOSE_MAKEFILE=ON -DCMAKE_INSTALL_LIBDIR=lib/arm-linux-gnueabihf -DCMAKE_BUILD_TYPE=none -DTA_BUILD_UNITTEST=ON -DTA_ERROR=throw -DENABLE_SHARED_LIBRARIES=OFF "-DCMAKE_CXX_FLAGS=-g -O2 -fdebug-prefix-map=/<<PKGBUILDDIR>>=. -fstack-protector-strong -Wformat -Werror=format-security -I/usr/include/arm-linux-gnueabihf/mpich -g1" "-DCMAKE_EXE_LINKER_FLAGS=-lmpich -lm -lbacktrace -lpthread -lrt" .. returned exit code 1
make[1]: *** [debian/rules:43: override_dh_auto_configure] Error 2
make[1]: Leaving directory '/<<PKGBUILDDIR>>'
make: *** [debian/rules:40: build-arch] Error 2

Tail of log for acl2 on armhf:

Raw Lisp Break.
Condition in INITIALIZE-ACL2 [or a callee]: INTERNAL-SIMPLE-ERROR: Caught fatal error [memory may be damaged]

Broken at APPLY.  Type :H for Help.
    1  Return to top level. 
ACL2>>make[2]: Entering directory '/<<PKGBUILDDIR>>'
ACL2_WD is /<<PKGBUILDDIR>>
ACL2 is /<<PKGBUILDDIR>>/saved_acl2
Initialization FAILED: acl2-status.txt should contain :INITIALIZED.
make[2]: *** [GNUmakefile:363: check_init_ok] Error 1
make[2]: Leaving directory '/<<PKGBUILDDIR>>'
make[1]: *** [GNUmakefile:499: init] Error 2
make[1]: Leaving directory '/<<PKGBUILDDIR>>'
make: *** [debian/rules:71: saved_acl2] Error 2

Tail of log for varnish-agent on armhf:

src/Makefile.am:8: warning: source file 'modules/vlog.c' is in a subdirectory,
src/Makefile.am:8: but option 'subdir-objects' is disabled
src/Makefile.am:8: warning: source file 'modules/vban.c' is in a subdirectory,
src/Makefile.am:8: but option 'subdir-objects' is disabled
src/Makefile.am:8: warning: source file 'modules/curl.c' is in a subdirectory,
src/Makefile.am:8: but option 'subdir-objects' is disabled
src/Makefile.am:8: warning: source file 'modules/vdirect.c' is in a subdirectory,
src/Makefile.am:8: but option 'subdir-objects' is disabled
src/Makefile.am:8: warning: source file 'modules/vac_register.c' is in a subdirectory,
src/Makefile.am:8: but option 'subdir-objects' is disabled
src/Makefile.am: installing './depcomp'
parallel-tests: installing './test-driver'
autoreconf: automake failed with exit status: 1
dh_autoreconf: autoreconf -f -i returned exit code 1
make: *** [debian/rules:46: build-arch] Error 2

Tail of log for colmap on armhf:

/<<PKGBUILDDIR>>/lib/FLANN/algorithms/autotuned_index.h:387:31: note: parameter passing for argument of type 'flann::L2<double>' changed in GCC 7.1
         KMeansIndex<Distance> kmeans(sampledDataset_, cost.params, distance_);
                               ^~~~~~
[ 81%] Linking CXX static library libflann.a
cd /<<PKGBUILDDIR>>/obj-arm-linux-gnueabihf/lib/FLANN && /usr/bin/cmake -P CMakeFiles/flann.dir/cmake_clean_target.cmake
cd /<<PKGBUILDDIR>>/obj-arm-linux-gnueabihf/lib/FLANN && /usr/bin/cmake -E cmake_link_script CMakeFiles/flann.dir/link.txt --verbose=1
/usr/bin/ar qc libflann.a  CMakeFiles/flann.dir/flann.cpp.o CMakeFiles/flann.dir/ext/lz4.c.o CMakeFiles/flann.dir/ext/lz4hc.c.o
/usr/bin/ranlib libflann.a
make[3]: Leaving directory '/<<PKGBUILDDIR>>/obj-arm-linux-gnueabihf'
[ 81%] Built target flann
make[2]: Leaving directory '/<<PKGBUILDDIR>>/obj-arm-linux-gnueabihf'
make[1]: *** [Makefile:133: all] Error 2
make[1]: Leaving directory '/<<PKGBUILDDIR>>/obj-arm-linux-gnueabihf'
dh_auto_build: cd obj-arm-linux-gnueabihf && make -j4 "INSTALL=install --strip-program=true" returned exit code 2
make: *** [debian/rules:28: build-arch] Error 2