Raspbian Package Auto-Building

Buildd status for tcpdump, coturn (jessie-staging)

Bugs

Package(s): Suite:
Compact mode Co-maintainers

Package armhf
Buildd exposure stats
✘ tcpdump  Build-Attempted
✘ coturn  Build-Attempted

Tail of log for tcpdump on armhf:

> 	Domain name: , Seq number: 0, Config Rev fb499603
Failed test: vtp_asan-3

2c2
< 	Domain name: , Seq number: 0, Config Rev 4040404[|vtp]
---
> 	Domain name: , Seq number: 0, Config Rev 4040404


Makefile:440: recipe for target 'check' failed
make[1]: *** [check] Error 2
make[1]: Leaving directory '/<<PKGBUILDDIR>>'
dh_auto_test: make -j4 check returned exit code 2
debian/rules:7: recipe for target 'build-arch' failed
make: *** [build-arch] Error 2

Tail of log for coturn on armhf:

mkdir -p include/turn/client
cp -pf src/client/*.h include/turn/client/
cp -pf src/client++/*.h include/turn/client/
cp -pf src/ns_turn_defs.h include/turn/
make[1]: Leaving directory '/<<PKGBUILDDIR>>'
   dh_auto_test -a -O--builddirectory=.
	make -j1 test
make[1]: Entering directory '/<<PKGBUILDDIR>>'
bin/turnutils_rfc5769check
Makefile:93: recipe for target 'check' failed
make[1]: *** [check] Bus error
make[1]: Leaving directory '/<<PKGBUILDDIR>>'
dh_auto_test: make -j1 test returned exit code 2
debian/rules:20: recipe for target 'build-arch' failed
make: *** [build-arch] Error 2