Raspbian Package Auto-Building

Buildd status for tbb (jessie-staging)

Debian PTSTrackerChangelogBugspackages.d.obuildd.d.o

Package(s): Suite:
Compact mode Co-maintainers

ArchitectureVersionStatusForBuilddStateMiscLogs
Buildd exposure stats armhf  4.2~20140122-5Build-Attempted124d 22h 31mmb-lxc-01uncompiledlibs:sourceold | all (8)

Tail of log for tbb on armhf:

make[3]: *** [concurrent_hash_map.o] Error 1
../../build/common_rules.inc:85: recipe for target 'concurrent_queue.o' failed
make[3]: *** [concurrent_queue.o] Error 1
../../build/common_rules.inc:85: recipe for target 'concurrent_vector.o' failed
make[3]: *** [concurrent_vector.o] Error 1
make[3]: Leaving directory '/<<PKGBUILDDIR>>/build/linux_armv8l_gcc_cc4.9.2_libc2.19_kernel4.4.0_debug'
Makefile:40: recipe for target 'tbb' failed
make[2]: *** [tbb] Error 2
make[2]: Leaving directory '/<<PKGBUILDDIR>>'
dh_auto_build: make -j4 returned exit code 2
debian/rules:17: recipe for target 'override_dh_auto_build' failed
make[1]: *** [override_dh_auto_build] Error 2
make[1]: Leaving directory '/<<PKGBUILDDIR>>'
debian/rules:12: recipe for target 'build-arch' failed
make: *** [build-arch] Error 2