Raspbian Package Auto-Building

Buildd status for tarantool (stretch-staging)

Debian PTSTrackerChangelogBugspackages.d.obuildd.d.o

Package(s): Suite:
Compact mode Co-maintainers

ArchitectureVersionStatusForBuilddStateMiscLogs
Buildd exposure stats armhf  1.7.2.385.g952d79e-1Build-Attempted907d 2h 43mbm-wb-03uncompileddatabase:sourceold | all (6)

Tail of log for tarantool on armhf:

/<<PKGBUILDDIR>>/third_party/coro/coro.c:479:14: note: each undeclared identifier is reported only once for each function it appears in
/<<PKGBUILDDIR>>/third_party/coro/coro.c:493:4: error: #error unsupported architecture
   #error unsupported architecture
    ^~~~~
CMakeFiles/coro.dir/build.make:65: recipe for target 'CMakeFiles/coro.dir/third_party/coro/coro.c.o' failed
make[3]: *** [CMakeFiles/coro.dir/third_party/coro/coro.c.o] Error 1
make[3]: Leaving directory '/<<PKGBUILDDIR>>/obj-arm-linux-gnueabihf'
CMakeFiles/Makefile2:384: recipe for target 'CMakeFiles/coro.dir/all' failed
make[2]: *** [CMakeFiles/coro.dir/all] Error 2
make[2]: Leaving directory '/<<PKGBUILDDIR>>/obj-arm-linux-gnueabihf'
Makefile:152: recipe for target 'all' failed
make[1]: *** [all] Error 2
make[1]: Leaving directory '/<<PKGBUILDDIR>>/obj-arm-linux-gnueabihf'
/usr/share/cdbs/1/class/makefile.mk:77: recipe for target 'debian/stamp-makefile-build' failed
make: *** [debian/stamp-makefile-build] Error 2