Raspbian Package Auto-Building

Buildd status for stopmotion (stretch-staging)

Debian PTSTrackerChangelogBugspackages.d.obuildd.d.o

Package(s): Suite:
Compact mode Co-maintainers

ArchitectureVersionStatusForBuilddStateMiscLogs
Buildd exposure stats armhf  0.8.1-1Build-Attempted905d 16h 27mbm-wb-02out-of-datex11:sourceold | all (7)

Tail of log for stopmotion on armhf:

src/technical/audio/ossdriver.cpp:123:2: error: narrowing conversion of '3221508098u' from 'unsigned int' to 'int' inside { } [-Wnarrowing]
src/technical/audio/ossdriver.cpp: In member function 'virtual void OSSDriver::play()':
src/technical/audio/ossdriver.cpp:80:41: warning: ignoring return value of 'ssize_t write(int, const void*, size_t)', declared with attribute warn_unused_result [-Wunused-result]
     write(audioFD, audioBuffer, written);
                                         ^
Makefile.Release:995: recipe for target 'build/release/ossdriver.o' failed
make[2]: *** [build/release/ossdriver.o] Error 1
make[2]: *** Waiting for unfinished jobs....
make[2]: Leaving directory '/<<PKGBUILDDIR>>'
Makefile:34: recipe for target 'release' failed
make[1]: *** [release] Error 2
make[1]: Leaving directory '/<<PKGBUILDDIR>>'
dh_auto_build: make -j4 returned exit code 2
debian/rules:7: recipe for target 'build-arch' failed
make: *** [build-arch] Error 25