Raspbian Package Auto-Building

Buildd status for sortmerna (stretch-staging)

Debian PTSTrackerChangelogBugspackages.d.obuildd.d.o

Package(s): Suite:
Compact mode Co-maintainers

ArchitectureVersionStatusForBuilddStateMiscLogs
Buildd exposure stats armhf  2.1-1Build-Attempted901d 23h 42mmb-lxc-01uncompiledmisc:sourceold | all (11)

Tail of log for sortmerna on armhf:

touch index/.tobuild
dh_auto_build
	make -j1
make[2]: Entering directory '/<<PKGBUILDDIR>>'
gcc -DHAVE_CONFIG_H -I. -I./include   -Wdate-time -D_FORTIFY_SOURCE=2  -g -O2 -fdebug-prefix-map=/<<PKGBUILDDIR>>=. -fstack-protector-strong -Wformat -Werror=format-security -pipe -funroll-loops -msse2 -Wall -fopenmp -c -o cmph/bdz.o cmph/bdz.c
gcc: error: unrecognized command line option '-msse2'
Makefile:644: recipe for target 'cmph/bdz.o' failed
make[2]: *** [cmph/bdz.o] Error 1
make[2]: Leaving directory '/<<PKGBUILDDIR>>'
dh_auto_build: make -j1 returned exit code 2
debian/rules:25: recipe for target 'override_dh_auto_build' failed
make[1]: *** [override_dh_auto_build] Error 2
make[1]: Leaving directory '/<<PKGBUILDDIR>>'
debian/rules:13: recipe for target 'build-arch' failed
make: *** [build-arch] Error 2