Raspbian Package Auto-Building

Buildd status for socat (bullseye-staging)

Debian PTSTrackerChangelogBugspackages.d.obuildd.d.o

Package(s): Suite:
Compact mode Co-maintainers

ArchitectureVersionStatusForBuilddStateMiscLogs
Buildd exposure stats armhf  1.7.3.3-2Build-Attempted8d 23h 22mmb-lxc-02out-of-datenet:sourceold | all (3)

Tail of log for socat on armhf:

test 365 UNIX_LISTEN_REMOVE_FORK: UNIX-LISTEN with fork removes socket entry when terminated during accept... OK
test 374 OPENSSL_METHOD_DTLS1: test OpenSSL method DTLS1... Option openssl-method not available
test 375 FDOUT_ERROR: fdout bails out in write-only context... OK
test 376 SYSTEM_RC: promote failure of SYSTEM... OK
test 377 EXEC_RC: promote failure of EXEC... OK
test 378 SO_REUSEADDR: test the so-reuseaddr option... OK
test 379 SO_REUSEPORT: test the so-reuseport option... OK
test 382 USE_IPV6_JOIN_GROUP: is option ipv6-join-group used... OK
test 383 DIAG_FDIN: test use of fdin=3... OK
summary: 385 tests, 353 selected; 264 ok, 13 failed, 76 could not be performed
FAILED:  61 62 63 72 73 74 75 76 77 79 215 306 307
make[1]: *** [Makefile:187: test] Error 1
make[1]: Leaving directory '/<<PKGBUILDDIR>>'
dh_auto_test: make -j4 test VERBOSE=1 returned exit code 2
make: *** [debian/rules:15: build-arch] Error 255