Raspbian Package Auto-Building

Buildd status for snap-aligner (stretch-staging)

Debian PTSTrackerChangelogBugspackages.d.obuildd.d.o

Package(s): Suite:
Compact mode Co-maintainers

ArchitectureVersionStatusForBuilddStateMiscLogs
Buildd exposure stats armhf  1.0~beta.18+dfsg-1Build-Attempted900d 2h 33mbm-wb-02uncompiledmisc:sourceold | all (6)

Tail of log for snap-aligner on armhf:

     ^~~
/usr/include/c++/6/bits/stl_algobase.h:219:5: note:   template argument deduction/substitution failed:
SNAPLib/SortedDataWriter.cpp:338:70: note:   deduced conflicting types for parameter 'const _Tp' ('long unsigned int' and '_int64 {aka long long int}')
             min(1UL << 23, max(1UL << 17, bufferSpace / blocks.size()))); // 128kB to 8MB buffer space per block
                                                                      ^
<builtin>: recipe for target 'SNAPLib/SortedDataWriter.o' failed
make[2]: *** [SNAPLib/SortedDataWriter.o] Error 1
make[2]: *** Waiting for unfinished jobs....
make[2]: Leaving directory '/<<BUILDDIR>>/snap-aligner-1.0~beta.18+dfsg'
dh_auto_build: make -j4 returned exit code 2
debian/rules:18: recipe for target 'override_dh_auto_build' failed
make[1]: *** [override_dh_auto_build] Error 2
make[1]: Leaving directory '/<<BUILDDIR>>/snap-aligner-1.0~beta.18+dfsg'
debian/rules:11: recipe for target 'build-arch' failed
make: *** [build-arch] Error 2