Raspbian Package Auto-Building

Buildd status for sfcgal, lloconv (bullseye-staging)

Bugs

Package(s): Suite:
Compact mode Co-maintainers

Package armhf
Buildd exposure stats
✔ sfcgalBuild-Attempted
✘ lloconv  Building

Tail of log for sfcgal on armhf:

/usr/bin/ld: CMakeFiles/SFCGAL.dir/detail/generator/building.cpp.o:(.data.rel.ro+0x3c): multiple definition of `typeinfo for CORE::AddSubRep<CORE::Add>'; CMakeFiles/SFCGAL.dir/algorithm/straightSkeleton.cpp.o:(.data.rel.ro+0x3c): first defined here
/usr/bin/ld: CMakeFiles/SFCGAL.dir/detail/generator/building.cpp.o:(.data.rel.ro+0x48): multiple definition of `typeinfo for CORE::AddSubRep<CORE::Sub>'; CMakeFiles/SFCGAL.dir/algorithm/straightSkeleton.cpp.o:(.data.rel.ro+0x48): first defined here
/usr/bin/ld: CMakeFiles/SFCGAL.dir/detail/generator/building.cpp.o:(.data.rel.ro+0x54): multiple definition of `typeinfo for CORE::ConstPolyRep<CORE::Expr>'; CMakeFiles/SFCGAL.dir/algorithm/straightSkeleton.cpp.o:(.data.rel.ro+0x54): first defined here
/usr/bin/ld: CMakeFiles/SFCGAL.dir/detail/generator/building.cpp.o:(.data.rel.ro+0x60): multiple definition of `typeinfo for CORE::ConstPolyRep<CORE::BigFloat>'; CMakeFiles/SFCGAL.dir/algorithm/straightSkeleton.cpp.o:(.data.rel.ro+0x60): first defined here
/usr/bin/ld: CMakeFiles/SFCGAL.dir/detail/generator/building.cpp.o:(.data.rel.ro+0x6c): multiple definition of `typeinfo for CORE::ConstPolyRep<CORE::BigInt>'; CMakeFiles/SFCGAL.dir/algorithm/straightSkeleton.cpp.o:(.data.rel.ro+0x6c): first defined here
/usr/bin/ld: CMakeFiles/SFCGAL.dir/detail/generator/building.cpp.o:(.data.rel.ro+0x78): multiple definition of `typeinfo for CORE::ConstPolyRep<CORE::BigRat>'; CMakeFiles/SFCGAL.dir/algorithm/straightSkeleton.cpp.o:(.data.rel.ro+0x78): first defined here
collect2: error: ld returned 1 exit status
make[3]: *** [src/CMakeFiles/SFCGAL.dir/build.make:1425: src/libSFCGAL.so.1.3.8] Error 1
make[3]: Leaving directory '/<<PKGBUILDDIR>>/obj-arm-linux-gnueabihf'
make[2]: *** [CMakeFiles/Makefile2:280: src/CMakeFiles/SFCGAL.dir/all] Error 2
make[2]: Leaving directory '/<<PKGBUILDDIR>>/obj-arm-linux-gnueabihf'
make[1]: *** [Makefile:163: all] Error 2
make[1]: Leaving directory '/<<PKGBUILDDIR>>/obj-arm-linux-gnueabihf'
dh_auto_build: error: cd obj-arm-linux-gnueabihf && make -j4 returned exit code 2
make: *** [debian/rules:22: build-arch] Error 25

BinNMU changelog for lloconv on armhf:

rebuild due to debcheck failure