Raspbian Package Auto-Building

Buildd status for scrappie (bullseye-staging)

Debian PTSTrackerChangelogBugspackages.d.obuildd.d.o

Package(s): Suite:
Compact mode Co-maintainers

ArchitectureVersionStatusForBuilddStateMiscLogs
Buildd exposure stats armhf  1.4.2-2Build-Attempted72d 10h 48mtestbuildduncompiledmisc:sourceold | all (2)

Tail of log for scrappie on armhf:

                 from /<<PKGBUILDDIR>>/src/decode.c:3:
/<<PKGBUILDDIR>>/src/scrappie_matrix.h:5:14: fatal error: immintrin.h: No such file or directory
    5 | #    include <immintrin.h>
      |              ^~~~~~~~~~~~~
compilation terminated.
make[4]: *** [CMakeFiles/scrappie_objects.dir/build.make:63: CMakeFiles/scrappie_objects.dir/src/decode.c.o] Error 1
make[4]: Leaving directory '/<<PKGBUILDDIR>>/build'
make[3]: *** [CMakeFiles/Makefile2:85: CMakeFiles/scrappie_objects.dir/all] Error 2
make[3]: Leaving directory '/<<PKGBUILDDIR>>/build'
make[2]: *** [Makefile:163: all] Error 2
make[2]: Leaving directory '/<<PKGBUILDDIR>>/build'
make[1]: *** [Makefile:21: build/scrappie] Error 2
make[1]: Leaving directory '/<<PKGBUILDDIR>>'
dh_auto_build: error: make -j4 "INSTALL=install --strip-program=true" returned exit code 2
make: *** [debian/rules:9: binary-arch] Error 25