Raspbian Package Auto-Building

Buildd status for scamp (bullseye-staging)

Debian PTSTrackerChangelogBugspackages.d.obuildd.d.o

Package(s): Suite:
Compact mode Co-maintainers

ArchitectureVersionStatusForBuilddStateMiscLogs
Buildd exposure stats armhf  2.10.0-2Build-Attempted1109d 12h 11mbm-wb-02out-of-datemisc:optionalold | all (9)

Tail of log for scamp on armhf:

# ERROR: 0
============================================================================
See tests/test-suite.log
Please report to astromatic@astromatic.net
============================================================================
make[4]: *** [Makefile:782: test-suite.log] Error 1
make[4]: Leaving directory '/<<PKGBUILDDIR>>/tests'
make[3]: *** [Makefile:890: check-TESTS] Error 2
make[3]: Leaving directory '/<<PKGBUILDDIR>>/tests'
make[2]: *** [Makefile:992: check-am] Error 2
make[2]: Leaving directory '/<<PKGBUILDDIR>>/tests'
make[1]: *** [Makefile:537: check-recursive] Error 1
make[1]: Leaving directory '/<<PKGBUILDDIR>>'
dh_auto_test: error: make -j4 check VERBOSE=1 returned exit code 2
make: *** [debian/rules:7: binary-arch] Error 25