Raspbian Package Auto-Building

Buildd status for sagemath (stretch-staging)

Debian PTSTrackerChangelogBugspackages.d.obuildd.d.o

Package(s): Suite:
Compact mode Co-maintainers

ArchitectureVersionStatusForBuilddStateMiscLogs
Buildd exposure stats armhf  7.4-9Build-Attempted2529d 8h 32mbm-wb-03uncompiledmisc:extraold | all (7)

Tail of log for sagemath on armhf:

sage -t --long src/doc/common/conf.py  # 1 doctest failed
sage -t --long src/doc/en/thematic_tutorials/numerical_sage/cvxopt.rst  # 1 doctest failed
----------------------------------------------------------------------
Total time for all tests: 8577.2 seconds
    cpu time: 4866.5 seconds
    cumulative wall time: 4944.3 seconds
make[2]: Entering directory '/<<PKGBUILDDIR>>'
debian/rules:136: recipe for target 'had-few-failures' failed
make[2]: *** [had-few-failures] Error 1
make[2]: Leaving directory '/<<PKGBUILDDIR>>'
debian/rules:105: recipe for target 'override_dh_auto_test' failed
make[1]: *** [override_dh_auto_test] Error 2
make[1]: Leaving directory '/<<PKGBUILDDIR>>'
debian/rules:41: recipe for target 'build-arch' failed
make: *** [build-arch] Error 2