Raspbian Package Auto-Building

Buildd status for rust-pq-sys (bullseye-staging)

Debian PTSTrackerChangelogBugspackages.d.obuildd.d.o

Package(s): Suite:
Compact mode Co-maintainers

ArchitectureVersionStatusForBuilddStateMiscLogs
Buildd exposure stats armhf  0.4.6-1Build-Attempted16d 9h 33mbm-wb-04uncompiledmisc:sourceold | all (3)

Tail of log for rust-pq-sys on armhf:

failures:
    bindgen_test_layout__PQconninfoOption
    bindgen_test_layout__PQprintOpt
    bindgen_test_layout___sFILE
    bindgen_test_layout___sbuf
    bindgen_test_layout_pgNotify
    bindgen_test_layout_pgresAttDesc

test result: FAILED. 2 passed; 6 failed; 0 ignored; 0 measured; 0 filtered out

error: test failed, to rerun pass '--lib'
dh_auto_test: /usr/share/cargo/bin/cargo test --all returned exit code 101
make[1]: *** [debian/rules:6: override_dh_auto_test] Error 255
make[1]: Leaving directory '/<<PKGBUILDDIR>>'
make: *** [debian/rules:3: build-arch] Error 2