Raspbian Package Auto-Building

Buildd status for rust-mach-o-sys (bullseye-staging)

Debian PTSTrackerChangelogBugspackages.d.obuildd.d.o

Package(s): Suite:
Compact mode Co-maintainers

ArchitectureVersionStatusForBuilddStateMiscLogs
Buildd exposure stats armhf  0.1.1-3Build-Attempted69d 16h 26mtestbuildduncompiledmisc:extraold | all (6)

Tail of log for rust-mach-o-sys on armhf:

Caused by:
  process didn't exit successfully: `CARGO=/usr/bin/cargo CARGO_PKG_VERSION_MINOR=1 CARGO_PKG_VERSION_PATCH=1 CARGO_PKG_HOMEPAGE= LD_LIBRARY_PATH='/<<PKGBUILDDIR>>/target/debug/deps:/usr/lib' CARGO_PKG_AUTHORS='Nick Fitzgerald <fitzgen@gmail.com>' CARGO_PKG_VERSION_MAJOR=0 CARGO_PKG_VERSION=0.1.1 CARGO_PKG_VERSION_PRE= CARGO_PKG_NAME=mach_o_sys CARGO_MANIFEST_DIR=/<<PKGBUILDDIR>> CARGO_PKG_REPOSITORY='https://github.com/fitzgen/mach_o_sys' CARGO_PKG_DESCRIPTION='Bindings to the OSX mach-o system library' rustc --crate-name mach_o_sys src/lib.rs --error-format=json --json=diagnostic-rendered-ansi --crate-type lib --emit=dep-info,metadata,link -C debuginfo=2 -C metadata=54e05a23b9e7b924 -C extra-filename=-54e05a23b9e7b924 --out-dir /<<PKGBUILDDIR>>/target/arm-unknown-linux-gnueabihf/debug/deps --target arm-unknown-linux-gnueabihf -C incremental=/<<PKGBUILDDIR>>/target/arm-unknown-linux-gnueabihf/debug/incremental -L dependency=/<<PKGBUILDDIR>>/target/arm-unknown-linux-gnueabihf/debug/deps -L dependency=/<<PKGBUILDDIR>>/target/debug/deps -C debuginfo=2 --cap-lints warn -C linker=arm-linux-gnueabihf-gcc -C link-arg=-Wl,-z,relro --remap-path-prefix /<<PKGBUILDDIR>>=/usr/share/cargo/registry/mach-o-sys-0.1.1` (exit code: 1)
warning: build failed, waiting for other jobs to finish...
error: aborting due to 130 previous errors

For more information about this error, try `rustc --explain E0600`.
error: could not compile `mach_o_sys`.

Caused by:
  process didn't exit successfully: `CARGO=/usr/bin/cargo CARGO_PKG_VERSION_MINOR=1 CARGO_PKG_VERSION_PATCH=1 CARGO_PKG_HOMEPAGE= LD_LIBRARY_PATH='/<<PKGBUILDDIR>>/target/debug/deps:/usr/lib' CARGO_PKG_AUTHORS='Nick Fitzgerald <fitzgen@gmail.com>' CARGO_PKG_VERSION_MAJOR=0 CARGO_PKG_VERSION=0.1.1 CARGO_PKG_VERSION_PRE= CARGO_PKG_NAME=mach_o_sys CARGO_MANIFEST_DIR=/<<PKGBUILDDIR>> CARGO_PKG_REPOSITORY='https://github.com/fitzgen/mach_o_sys' CARGO_PKG_DESCRIPTION='Bindings to the OSX mach-o system library' rustc --crate-name mach_o_sys src/lib.rs --error-format=json --json=diagnostic-rendered-ansi --emit=dep-info,link -C debuginfo=2 --test -C metadata=c1f25cab3e8f5708 -C extra-filename=-c1f25cab3e8f5708 --out-dir /<<PKGBUILDDIR>>/target/arm-unknown-linux-gnueabihf/debug/deps --target arm-unknown-linux-gnueabihf -C incremental=/<<PKGBUILDDIR>>/target/arm-unknown-linux-gnueabihf/debug/incremental -L dependency=/<<PKGBUILDDIR>>/target/arm-unknown-linux-gnueabihf/debug/deps -L dependency=/<<PKGBUILDDIR>>/target/debug/deps -C debuginfo=2 --cap-lints warn -C linker=arm-linux-gnueabihf-gcc -C link-arg=-Wl,-z,relro --remap-path-prefix /<<PKGBUILDDIR>>=/usr/share/cargo/registry/mach-o-sys-0.1.1` (exit code: 1)
dh_auto_test: error: /usr/share/cargo/bin/cargo test --all returned exit code 101
make[1]: *** [debian/rules:6: override_dh_auto_test] Error 25
make[1]: Leaving directory '/<<PKGBUILDDIR>>'
make: *** [debian/rules:3: build-arch] Error 2