Raspbian Package Auto-Building

Buildd status for rust-generator (bullseye-staging)

Debian PTSTrackerChangelogBugspackages.d.obuildd.d.o

Package(s): Suite:
Compact mode Co-maintainers

ArchitectureVersionStatusForBuilddStateMiscLogs
Buildd exposure stats armhf  0.6.20-2Build-Attempted72d 13h 55mtest2019uncompiledmisc:sourceold | all (5)

Tail of log for rust-generator on armhf:

             at src/libstd/panicking.rs:281
  19: std::panic::catch_unwind
             at src/libstd/panic.rs:394
  20: std::rt::lang_start_internal
             at src/libstd/rt.rs:51
  21: std::rt::lang_start
             at /usr/src/rustc-1.43.0/src/libstd/rt.rs:67
  22: main
  23: __libc_start_main
note: Some details are omitted, run with `RUST_BACKTRACE=full` for a verbose backtrace.

dh_auto_test: error: /usr/share/cargo/bin/cargo test --all returned exit code 101
make[1]: *** [debian/rules:6: override_dh_auto_test] Error 25
make[1]: Leaving directory '/<<PKGBUILDDIR>>'
make: *** [debian/rules:3: build-arch] Error 2