Raspbian Package Auto-Building

Buildd status for ruby2.1 (stretch-staging)

Debian PTSTrackerChangelogBugspackages.d.obuildd.d.o

Package(s): Suite:
Compact mode Co-maintainers

ArchitectureVersionStatusForBuilddStateMiscLogs
Buildd exposure stats armhf  2.1.5-4Build-Attempted899d 20h 21mmb-lxc-01uncompiledmisc:sourceold | all (18)

Tail of log for ruby2.1 on armhf:

gcc -shared -o ../../.ext/arm-linux-gnueabihf/pathname.so pathname.o -L. -L../.. -L. -Wl,-z,relro -L/<<PKGBUILDDIR>>/debian/lib -fstack-protector -rdynamic -Wl,-export-dynamic    -lruby-2.1  -lpthread -lgmp -ldl -lcrypt -lm   -lc
make[4]: Leaving directory '/<<PKGBUILDDIR>>/ext/pathname'
rm -f ../../.ext/arm-linux-gnueabihf/nkf.so
gcc -shared -o ../../.ext/arm-linux-gnueabihf/nkf.so nkf.o -L. -L../.. -L. -Wl,-z,relro -L/<<PKGBUILDDIR>>/debian/lib -fstack-protector -rdynamic -Wl,-export-dynamic    -lruby-2.1  -lpthread -lgmp -ldl -lcrypt -lm   -lc
make[4]: Leaving directory '/<<PKGBUILDDIR>>/ext/nkf'
make[3]: Leaving directory '/<<PKGBUILDDIR>>'
uncommon.mk:180: recipe for target 'build-ext' failed
make[2]: *** [build-ext] Error 2
make[2]: Leaving directory '/<<PKGBUILDDIR>>'
dh_auto_build: make -j4 main V=1 returned exit code 2
debian/rules:67: recipe for target 'override_dh_auto_build-arch' failed
make[1]: *** [override_dh_auto_build-arch] Error 2
make[1]: Leaving directory '/<<PKGBUILDDIR>>'
debian/rules:49: recipe for target 'build-arch' failed
make: *** [build-arch] Error 2