Raspbian Package Auto-Building

Buildd status for ruby2.1 (buster-staging)

Debian PTSTrackerChangelogBugspackages.d.obuildd.d.o

Package(s): Suite:
Compact mode Co-maintainers

ArchitectureVersionStatusForBuilddStateMiscLogs
Buildd exposure stats armhf  2.1.5-4Build-Attempted164d 4h 31mmb-lxc-01uncompiledmisc:sourceold | all (30)

Tail of log for ruby2.1 on armhf:

make[4]: Leaving directory '/<<PKGBUILDDIR>>/ext/objspace'
gcc -I. -I../../../.ext/include/arm-linux-gnueabihf -I../../.././include -I../../.././ext/dl/callback -I../../.././ext/dl/callback/.. -DRUBY_EXTCONF_H=\"extconf.h\" -Wdate-time -D_FORTIFY_SOURCE=2 -D_FILE_OFFSET_BITS=64  -fPIC -g -O2 -fdebug-prefix-map=/<<PKGBUILDDIR>>=. -fstack-protector-strong -Wformat -Werror=format-security -fPIC  -o callback-8.o -c callback-8.c
rm -f ../../.ext/arm-linux-gnueabihf/nkf.so
gcc -shared -o ../../.ext/arm-linux-gnueabihf/nkf.so nkf.o -L. -L../.. -L. -Wl,-z,relro -L/<<PKGBUILDDIR>>/debian/lib -fstack-protector -rdynamic -Wl,-export-dynamic    -lruby-2.1  -lpthread -lgmp -ldl -lcrypt -lm   -lc
make[4]: Leaving directory '/<<PKGBUILDDIR>>/ext/nkf'
rm -f ../../../.ext/arm-linux-gnueabihf/dl/callback.so
gcc -shared -o ../../../.ext/arm-linux-gnueabihf/dl/callback.so callback.o callback-0.o callback-1.o callback-2.o callback-3.o callback-4.o callback-5.o callback-6.o callback-7.o callback-8.o -L. -L../../.. -L. -Wl,-z,relro -L/<<PKGBUILDDIR>>/debian/lib -fstack-protector -rdynamic -Wl,-export-dynamic    -lruby-2.1  -lpthread -lgmp -ldl -lcrypt -lm   -lc
make[4]: Leaving directory '/<<PKGBUILDDIR>>/ext/dl/callback'
make[3]: Leaving directory '/<<PKGBUILDDIR>>'
make[2]: *** [uncommon.mk:180: build-ext] Error 2
make[2]: Leaving directory '/<<PKGBUILDDIR>>'
dh_auto_build: make -j4 main V=1 returned exit code 2
make[1]: *** [debian/rules:67: override_dh_auto_build-arch] Error 2
make[1]: Leaving directory '/<<PKGBUILDDIR>>'
make: *** [debian/rules:49: build-arch] Error 2