Raspbian Package Auto-Building

Buildd status for ruby2.1 (bullseye-staging)

Debian PTSTrackerChangelogBugspackages.d.obuildd.d.o

Package(s): Suite:
Compact mode Co-maintainers

ArchitectureVersionStatusForBuilddStateMiscLogs
Buildd exposure stats armhf  2.1.5-4Build-Attempted65d 2h 33mbm-wb-01uncompiledmisc:sourceold | all (14)

Tail of log for ruby2.1 on armhf:

      | 
parse.c:10841:63: error: macro "yydestruct" passed 4 arguments, but takes just 3
10841 |      this YYABORT or YYACCEPT.  */
      |                                                               ^
parse.c:4967: note: macro "yydestruct" defined here
 4967 | #define yydestruct(m, t, v) ruby_parser_yydestruct(m, t, v, parser)
      | 
gcc -g -O2 -fdebug-prefix-map=/<<PKGBUILDDIR>>=. -fstack-protector-strong -Wformat -Werror=format-security -fPIC  -D_FORTIFY_SOURCE=2 -fstack-protector -fno-strict-overflow -fvisibility=hidden -DRUBY_EXPORT -Wdate-time -D_FORTIFY_SOURCE=2   -I. -I.ext/include/arm-linux-gnueabihf -I./include -I. -o compile.o -c compile.c
make[2]: *** [Makefile:334: parse.o] Error 1
make[2]: *** Waiting for unfinished jobs....
make[2]: Leaving directory '/<<PKGBUILDDIR>>'
dh_auto_build: error: make -j4 main V=1 returned exit code 2
make[1]: *** [debian/rules:67: override_dh_auto_build-arch] Error 25
make[1]: Leaving directory '/<<PKGBUILDDIR>>'
make: *** [debian/rules:49: build-arch] Error 2