Raspbian Package Auto-Building

Buildd status for rt-app (stretch-staging)

Debian PTSTrackerChangelogBugspackages.d.obuildd.d.o

Package(s): Suite:
Compact mode Co-maintainers

ArchitectureVersionStatusForBuilddStateMiscLogs
Buildd exposure stats armhf  0.2~alpha2.20140716-2.2Build-Attempted906d 7hmb-lxc-01uncompiledmisc:sourceold | all (10)

Tail of log for rt-app on armhf:

make[3]: *** Waiting for unfinished jobs....
rt-app.c: In function 'main':
rt-app.c:753:3: warning: implicit declaration of function 'sleep' [-Wimplicit-function-declaration]
   sleep(opts.duration);
   ^~~~~
make[3]: Leaving directory '/<<PKGBUILDDIR>>/src'
Makefile:311: recipe for target 'all' failed
make[2]: *** [all] Error 2
make[2]: Leaving directory '/<<PKGBUILDDIR>>/src'
Makefile:391: recipe for target 'all-recursive' failed
make[1]: *** [all-recursive] Error 1
make[1]: Leaving directory '/<<PKGBUILDDIR>>'
dh_auto_build: make -j4 returned exit code 2
debian/rules:7: recipe for target 'build-arch' failed
make: *** [build-arch] Error 2