Raspbian Package Auto-Building

Buildd status for rheolef (jessie-staging)

Debian PTSTrackerChangelogBugspackages.d.obuildd.d.o

Package(s): Suite:
Compact mode Co-maintainers

ArchitectureVersionStatusForBuilddStateMiscLogs
Buildd exposure stats armhf  6.5-1Build-Attempted182d 7h 15mmb-lxc-01uncompiledmath:sourceold | all (23)

Tail of log for rheolef on armhf:

../plib/.libs/libfem.a(geo.o):(.rodata+0x2c): first defined here
../plib/.libs/libfem.a(geo_domain_seq.o):(.data.rel.ro+0x0): multiple definition of `typeinfo for rheolef::geo_rep<double, rheolef::sequential>'
../plib/.libs/libfem.a(geo.o):(.data.rel.ro+0xc): first defined here
collect2: error: ld returned 1 exit status
Makefile:796: recipe for target 'librheolef.la' failed
make[4]: *** [librheolef.la] Error 1
Makefile:707: recipe for target 'all' failed
make[3]: *** [all] Error 2
Makefile:449: recipe for target 'all-recursive' failed
make[2]: *** [all-recursive] Error 1
Makefile:551: recipe for target 'all-recursive' failed
make[1]: *** [all-recursive] Error 1
make[1]: Leaving directory '/<<PKGBUILDDIR>>'
debian/rules:59: recipe for target 'build-stamp' failed
make: *** [build-stamp] Error 2