Raspbian Package Auto-Building

Buildd status for rheolef (buster-staging)

Debian PTSTrackerChangelogBugspackages.d.obuildd.d.o

Package(s): Suite:
Compact mode Co-maintainers

ArchitectureVersionStatusForBuilddStateMiscLogs
Buildd exposure stats armhf  7.0-2Build-Attempted166d 2h 32mtestbuildduncompiledmath:sourceold | all (18)

Tail of log for rheolef on armhf:

/usr/bin/ld: ../plib/.libs/libfem.a(geo_nearest.o):(.data.rel.ro+0x0): multiple definition of `typeinfo for rheolef::geo_base_rep<double, rheolef::sequential>'; ../plib/.libs/libfem.a(geo.o):(.data.rel.ro+0x0): first defined here
/usr/bin/ld: ../plib/.libs/libfem.a(geo_nearest.o):(.rodata+0x2c): multiple definition of `typeinfo name for rheolef::geo_rep<double, rheolef::sequential>'; ../plib/.libs/libfem.a(geo.o):(.rodata+0x2c): first defined here
/usr/bin/ld: ../plib/.libs/libfem.a(geo_nearest.o):(.data.rel.ro+0xc): multiple definition of `typeinfo for rheolef::geo_rep<double, rheolef::sequential>'; ../plib/.libs/libfem.a(geo.o):(.data.rel.ro+0xc): first defined here
/usr/bin/ld: ../plib/.libs/libfem.a(geo_domain_indirect_seq.o):(.rodata+0x3c): multiple definition of `typeinfo name for rheolef::geo_domain_indirect_rep<double, rheolef::sequential>'; ../plib/.libs/libfem.a(geo_domain_indirect.o):(.rodata+0x0): first defined here
/usr/bin/ld: ../plib/.libs/libfem.a(geo_domain_indirect_seq.o):(.data.rel.ro+0xc): multiple definition of `typeinfo for rheolef::geo_domain_indirect_rep<double, rheolef::sequential>'; ../plib/.libs/libfem.a(geo_domain_indirect.o):(.data.rel.ro+0x0): first defined here
/usr/bin/ld: ../plib/.libs/libfem.a(geo_domain_seq.o):(.rodata+0x0): multiple definition of `typeinfo name for rheolef::geo_rep<double, rheolef::sequential>'; ../plib/.libs/libfem.a(geo.o):(.rodata+0x2c): first defined here
/usr/bin/ld: ../plib/.libs/libfem.a(geo_domain_seq.o):(.data.rel.ro+0x0): multiple definition of `typeinfo for rheolef::geo_rep<double, rheolef::sequential>'; ../plib/.libs/libfem.a(geo.o):(.data.rel.ro+0xc): first defined here
collect2: error: ld returned 1 exit status
make[4]: *** [Makefile:628: librheolef.la] Error 1
make[3]: *** [Makefile:544: all] Error 2
make[2]: *** [Makefile:471: all-recursive] Error 1
make[1]: *** [Makefile:554: all-recursive] Error 1
make[1]: Leaving directory '/<<PKGBUILDDIR>>'
dh_auto_build: make -j1 returned exit code 2
make: *** [debian/rules:30: build-arch] Error 2