Raspbian Package Auto-Building

Buildd status for rheolef (bullseye-staging)

Debian PTSTrackerChangelogBugspackages.d.obuildd.d.o

Package(s): Suite:
Compact mode Co-maintainers

ArchitectureVersionStatusForBuilddStateMiscLogs
Buildd exposure stats armhf  7.0-3Build-Attempted7d 21hbm-wb-02uncompiledmath:sourceold | all (3)

Tail of log for rheolef on armhf:

/usr/bin/ld: ../plib/.libs/libfem.a(geo_domain_indirect_seq.o):(.data.rel.ro+0x18): multiple definition of `typeinfo for rheolef::geo_domain_indirect_rep<double, rheolef::sequential>'; ../plib/.libs/libfem.a(geo_domain_indirect.o):(.data.rel.ro+0x0): first defined here
/usr/bin/ld: ../plib/.libs/libfem.a(geo_domain_indirect_mpi.o):(.rodata+0x0): multiple definition of `typeinfo name for rheolef::geo_domain_indirect_rep<double, rheolef::distributed>'; ../plib/.libs/libfem.a(geo_domain_indirect.o):(.rodata+0x38): first defined here
/usr/bin/ld: ../plib/.libs/libfem.a(geo_domain_indirect_mpi.o):(.data.rel.ro+0x0): multiple definition of `typeinfo for rheolef::geo_domain_indirect_rep<double, rheolef::distributed>'; ../plib/.libs/libfem.a(geo_domain_indirect.o):(.data.rel.ro+0xc): first defined here
/usr/bin/ld: ../plib/.libs/libfem.a(geo_domain_seq.o):(.rodata+0x4): multiple definition of `typeinfo name for rheolef::geo_rep<double, rheolef::sequential>'; ../plib/.libs/libfem.a(geo.o):(.rodata+0x2c): first defined here
/usr/bin/ld: ../plib/.libs/libfem.a(geo_domain_seq.o):(.data.rel.ro+0x0): multiple definition of `typeinfo for rheolef::geo_rep<double, rheolef::sequential>'; ../plib/.libs/libfem.a(geo.o):(.data.rel.ro+0xc): first defined here
/usr/bin/ld: ../plib/.libs/libfem.a(geo_domain_mpi.o):(.rodata+0x4): multiple definition of `typeinfo name for rheolef::geo_rep<double, rheolef::distributed>'; ../plib/.libs/libfem.a(geo.o):(.rodata+0x84): first defined here
/usr/bin/ld: ../plib/.libs/libfem.a(geo_domain_mpi.o):(.data.rel.ro+0x0): multiple definition of `typeinfo for rheolef::geo_rep<double, rheolef::distributed>'; ../plib/.libs/libfem.a(geo.o):(.data.rel.ro+0x24): first defined here
collect2: error: ld returned 1 exit status
make[4]: *** [Makefile:628: librheolef.la] Error 1
make[3]: *** [Makefile:544: all] Error 2
make[2]: *** [Makefile:471: all-recursive] Error 1
make[1]: *** [Makefile:554: all-recursive] Error 1
make[1]: Leaving directory '/<<PKGBUILDDIR>>'
dh_auto_build: make -j1 returned exit code 2
make: *** [debian/rules:30: build-arch] Error 255