Raspbian Package Auto-Building

Buildd status for restinio (bullseye-staging)

Debian PTSTrackerChangelogBugspackages.d.obuildd.d.o

Package(s): Suite:
Compact mode Co-maintainers

ArchitectureVersionStatusForBuilddStateMiscLogs
Buildd exposure stats armhf  0.6.6-2Build-Attempted35d 8h 5mtestwandboarduncompiledmisc:extraold | all (1)

Tail of log for restinio on armhf:

[ 43%] Linking CXX executable sample.hello_world
cd /<<PKGBUILDDIR>>/obj-arm-linux-gnueabihf/sample/hello_world && /usr/bin/cmake -E cmake_link_script CMakeFiles/sample.hello_world.dir/link.txt --verbose=1
/usr/bin/c++  -g -O2 -fdebug-prefix-map=/<<PKGBUILDDIR>>=. -fstack-protector-strong -Wformat -Werror=format-security -Wdate-time -D_FORTIFY_SOURCE=2  -Wl,-z,relro -Wl,-z,now CMakeFiles/sample.hello_world.dir/main.cpp.o  -o sample.hello_world  /usr/lib/arm-linux-gnueabihf/libfmt.a -lhttp_parser -pthread 
make[3]: Leaving directory '/<<PKGBUILDDIR>>/obj-arm-linux-gnueabihf'
[ 43%] Built target sample.hello_world
[ 44%] Linking CXX executable _unit.test.socket_options_tls
cd /<<PKGBUILDDIR>>/obj-arm-linux-gnueabihf/test/socket_options_tls && /usr/bin/cmake -E cmake_link_script CMakeFiles/_unit.test.socket_options_tls.dir/link.txt --verbose=1
/usr/bin/c++  -g -O2 -fdebug-prefix-map=/<<PKGBUILDDIR>>=. -fstack-protector-strong -Wformat -Werror=format-security -Wdate-time -D_FORTIFY_SOURCE=2  -Wl,-z,relro -Wl,-z,now CMakeFiles/_unit.test.socket_options_tls.dir/main.cpp.o  -o _unit.test.socket_options_tls  ../catch_main/librestinio_catch_main.a /usr/lib/arm-linux-gnueabihf/libssl.so /usr/lib/arm-linux-gnueabihf/libcrypto.so /usr/lib/arm-linux-gnueabihf/libfmt.a -lhttp_parser -pthread 
make[3]: Leaving directory '/<<PKGBUILDDIR>>/obj-arm-linux-gnueabihf'
[ 44%] Built target _unit.test.socket_options_tls
make[2]: Leaving directory '/<<PKGBUILDDIR>>/obj-arm-linux-gnueabihf'
make[1]: *** [Makefile:144: all] Error 2
make[1]: Leaving directory '/<<PKGBUILDDIR>>/obj-arm-linux-gnueabihf'
dh_auto_build: error: cd obj-arm-linux-gnueabihf && make -j4 "INSTALL=install --strip-program=true" returned exit code 2
make: *** [debian/rules:27: binary-arch] Error 25