Raspbian Package Auto-Building

Buildd status for rauc (bullseye-staging)

Debian PTSTrackerChangelogBugspackages.d.obuildd.d.o

Package(s): Suite:
Compact mode Co-maintainers

ArchitectureVersionStatusForBuilddStateMiscLogs
Buildd exposure stats armhf  1.4-1Build-Attempted37d 18h 41mmb-lxc-02out-of-datemisc:extraold | all (1)

Tail of log for rauc on armhf:

# XFAIL: 0
# FAIL:  2
# XPASS: 0
# ERROR: 1
============================================================================
See ./test-suite.log
Please report to rauc@pengutronix.de
============================================================================
make[4]: *** [Makefile:1787: test-suite.log] Error 1
make[3]: *** [Makefile:1895: check-TESTS] Error 2
make[2]: *** [Makefile:2117: check-am] Error 2
make[1]: *** [Makefile:2119: check] Error 2
make[1]: Leaving directory '/<<PKGBUILDDIR>>'
dh_auto_test: error: make -j4 check VERBOSE=1 returned exit code 2
make: *** [debian/rules:7: binary-arch] Error 25