Raspbian Package Auto-Building

Buildd status for selected packages (buster-staging)

Bugs

Package(s): Suite:
Compact mode Co-maintainers

Package armhf
Buildd exposure stats
✘ r-cran-httpuv  Build-Attempted
✔ bagelBuild-Attempted
✔ kvmtoolBuild-Attempted
✔ ngs-sdkBuild-Attempted
✔ ocamlgslBuild-Attempted
✔ blastemBuild-Attempted
✔ freefoamBuild-Attempted
✔ lib3mfBuild-Attempted
✔ libxsmmBuild-Attempted
✔ minimap2Build-Attempted
✔ orpieBuild-Attempted
✔ prboomBuild-Attempted
✔ tarantoolBuild-Attempted
✔ trilinosBuild-Attempted
✔ qtoxBuild-Attempted
✔ agdaBuild-Attempted
✘ nbibtex  Build-Attempted

Tail of log for r-cran-httpuv on armhf:

gcc -std=gnu99 -I"/usr/share/R/include" -DNDEBUG -pthread -I"/usr/lib/R/site-library/Rcpp/include" -I"/usr/lib/R/site-library/BH/include" -I"/usr/lib/R/site-library/later/include"   -fvisibility=hidden -fpic  -g -O2 -fdebug-prefix-map=/build/r-base-xoRi9J/r-base-3.5.2=. -fstack-protector-strong -Wformat -Werror=format-security -Wdate-time -D_FORTIFY_SOURCE=2 -g  -c sha1/sha1.c -o sha1/sha1.o
g++ -std=gnu++11 -I"/usr/share/R/include" -DNDEBUG -pthread -I"/usr/lib/R/site-library/Rcpp/include" -I"/usr/lib/R/site-library/BH/include" -I"/usr/lib/R/site-library/later/include"   -fvisibility=hidden -fpic  -g -O2 -fdebug-prefix-map=/build/r-base-xoRi9J/r-base-3.5.2=. -fstack-protector-strong -Wformat -Werror=format-security -Wdate-time -D_FORTIFY_SOURCE=2 -g -c base64/base64.cpp -o base64/base64.o
g++ -std=gnu++11 -shared -L/usr/lib/R/lib -Wl,-z,relro -o httpuv.so RcppExports-legacy.o RcppExports.o callback.o callbackqueue.o filedatasource-unix.o filedatasource-win.o http.o httprequest.o httpresponse.o httpuv.o md5.o set_invalid_parameter.o socket.o thread.o utils.o uvutil.o webapplication.o websockets-base.o websockets-hixie76.o websockets-hybi03.o websockets-ietf.o websockets.o ./http-parser/http_parser.o ./sha1/sha1.o ./base64/base64.o -luv -L/usr/lib/R/lib -lR
make[1]: Leaving directory '/<<BUILDDIR>>/r-cran-httpuv-1.4.5.1+dfsg/src'
make[1]: Entering directory '/<<BUILDDIR>>/r-cran-httpuv-1.4.5.1+dfsg/src'
make[1]: Leaving directory '/<<BUILDDIR>>/r-cran-httpuv-1.4.5.1+dfsg/src'
installing to /<<BUILDDIR>>/r-cran-httpuv-1.4.5.1+dfsg/debian/r-cran-httpuv/usr/lib/R/site-library/httpuv/libs
** R
** demo
** byte-compile and prepare package for lazy loading
terminate called after throwing an instance of 'std::runtime_error'
  what():  Mutex creation failed
Aborted
dh_auto_install: R CMD INSTALL -l /<<BUILDDIR>>/r-cran-httpuv-1.4.5.1\+dfsg/debian/r-cran-httpuv/usr/lib/R/site-library --clean . "--built-timestamp='Mon, 07 Jan 2019 11:46:10 +0100'" returned exit code 134
make: *** [debian/rules:4: binary-arch] Error 2

Tail of log for bagel on armhf:

mpi_interface.cc:267:32: error: static assertion failed: size_t is assumed to be the same size as unsigned long long
   static_assert(sizeof(size_t) == sizeof(unsigned long long), "size_t is assumed to be the same size as unsigned long long");
                 ~~~~~~~~~~~~~~~^~~~~~~~~~~~~~~~~~~~~~~~~~~~~
make[5]: *** [Makefile:408: mpi_interface.lo] Error 1
make[5]: Leaving directory '/<<PKGBUILDDIR>>/src/util/parallel'
make[4]: *** [Makefile:462: all-recursive] Error 1
make[4]: Leaving directory '/<<PKGBUILDDIR>>/src/util'
make[3]: *** [Makefile:625: all-recursive] Error 1
make[3]: Leaving directory '/<<PKGBUILDDIR>>/src'
make[2]: *** [Makefile:422: all-recursive] Error 1
make[2]: Leaving directory '/<<PKGBUILDDIR>>'
make[1]: *** [Makefile:354: all] Error 2
make[1]: Leaving directory '/<<PKGBUILDDIR>>'
dh_auto_build: make -j1 returned exit code 2
make: *** [debian/rules:12: build-arch] Error 2

Tail of log for kvmtool on armhf:

gcc -c -Wp,-MD,./.guest_compat.o.d  -march=armv7-a -DCONFIG_GUEST_INIT -Wdate-time -D_FORTIFY_SOURCE=2 -DCONFIG_ARM -D_FILE_OFFSET_BITS=64 -D_GNU_SOURCE -DKVMTOOLS_VERSION='""' -DBUILD_ARCH='"arm"' -Iinclude -Iarm/include -Iarm/aarch32/include -O2 -fno-strict-aliasing -g -Wall -Wformat=2 -Winit-self -Wmissing-declarations -Wmissing-prototypes -Wnested-externs -Wno-system-headers -Wold-style-definition -Wredundant-decls -Wsign-compare -Wstrict-prototypes -Wundef -Wvolatile-register-var -Wwrite-strings -Wno-format-nonliteral -Werror -DCONFIG_HAS_ZLIB -DCONFIG_HAS_AIO -DCONFIG_HAS_LIBFDT guest_compat.c -o guest_compat.o
gcc -c -Wp,-MD,hw/.rtc.o.d  -march=armv7-a -DCONFIG_GUEST_INIT -Wdate-time -D_FORTIFY_SOURCE=2 -DCONFIG_ARM -D_FILE_OFFSET_BITS=64 -D_GNU_SOURCE -DKVMTOOLS_VERSION='""' -DBUILD_ARCH='"arm"' -Iinclude -Iarm/include -Iarm/aarch32/include -O2 -fno-strict-aliasing -g -Wall -Wformat=2 -Winit-self -Wmissing-declarations -Wmissing-prototypes -Wnested-externs -Wno-system-headers -Wold-style-definition -Wredundant-decls -Wsign-compare -Wstrict-prototypes -Wundef -Wvolatile-register-var -Wwrite-strings -Wno-format-nonliteral -Werror -DCONFIG_HAS_ZLIB -DCONFIG_HAS_AIO -DCONFIG_HAS_LIBFDT hw/rtc.c -o hw/rtc.o
gcc -c -Wp,-MD,hw/.serial.o.d  -march=armv7-a -DCONFIG_GUEST_INIT -Wdate-time -D_FORTIFY_SOURCE=2 -DCONFIG_ARM -D_FILE_OFFSET_BITS=64 -D_GNU_SOURCE -DKVMTOOLS_VERSION='""' -DBUILD_ARCH='"arm"' -Iinclude -Iarm/include -Iarm/aarch32/include -O2 -fno-strict-aliasing -g -Wall -Wformat=2 -Winit-self -Wmissing-declarations -Wmissing-prototypes -Wnested-externs -Wno-system-headers -Wold-style-definition -Wredundant-decls -Wsign-compare -Wstrict-prototypes -Wundef -Wvolatile-register-var -Wwrite-strings -Wno-format-nonliteral -Werror -DCONFIG_HAS_ZLIB -DCONFIG_HAS_AIO -DCONFIG_HAS_LIBFDT hw/serial.c -o hw/serial.o
gcc -c -Wp,-MD,./.ioport.o.d  -march=armv7-a -DCONFIG_GUEST_INIT -Wdate-time -D_FORTIFY_SOURCE=2 -DCONFIG_ARM -D_FILE_OFFSET_BITS=64 -D_GNU_SOURCE -DKVMTOOLS_VERSION='""' -DBUILD_ARCH='"arm"' -Iinclude -Iarm/include -Iarm/aarch32/include -O2 -fno-strict-aliasing -g -Wall -Wformat=2 -Winit-self -Wmissing-declarations -Wmissing-prototypes -Wnested-externs -Wno-system-headers -Wold-style-definition -Wredundant-decls -Wsign-compare -Wstrict-prototypes -Wundef -Wvolatile-register-var -Wwrite-strings -Wno-format-nonliteral -Werror -DCONFIG_HAS_ZLIB -DCONFIG_HAS_AIO -DCONFIG_HAS_LIBFDT ioport.c -o ioport.o
gcc -c -Wp,-MD,./.irq.o.d  -march=armv7-a -DCONFIG_GUEST_INIT -Wdate-time -D_FORTIFY_SOURCE=2 -DCONFIG_ARM -D_FILE_OFFSET_BITS=64 -D_GNU_SOURCE -DKVMTOOLS_VERSION='""' -DBUILD_ARCH='"arm"' -Iinclude -Iarm/include -Iarm/aarch32/include -O2 -fno-strict-aliasing -g -Wall -Wformat=2 -Winit-self -Wmissing-declarations -Wmissing-prototypes -Wnested-externs -Wno-system-headers -Wold-style-definition -Wredundant-decls -Wsign-compare -Wstrict-prototypes -Wundef -Wvolatile-register-var -Wwrite-strings -Wno-format-nonliteral -Werror -DCONFIG_HAS_ZLIB -DCONFIG_HAS_AIO -DCONFIG_HAS_LIBFDT irq.c -o irq.o
gcc -c -Wp,-MD,./.kvm-cpu.o.d  -march=armv7-a -DCONFIG_GUEST_INIT -Wdate-time -D_FORTIFY_SOURCE=2 -DCONFIG_ARM -D_FILE_OFFSET_BITS=64 -D_GNU_SOURCE -DKVMTOOLS_VERSION='""' -DBUILD_ARCH='"arm"' -Iinclude -Iarm/include -Iarm/aarch32/include -O2 -fno-strict-aliasing -g -Wall -Wformat=2 -Winit-self -Wmissing-declarations -Wmissing-prototypes -Wnested-externs -Wno-system-headers -Wold-style-definition -Wredundant-decls -Wsign-compare -Wstrict-prototypes -Wundef -Wvolatile-register-var -Wwrite-strings -Wno-format-nonliteral -Werror -DCONFIG_HAS_ZLIB -DCONFIG_HAS_AIO -DCONFIG_HAS_LIBFDT kvm-cpu.c -o kvm-cpu.o
gcc -c -Wp,-MD,./.kvm.o.d  -march=armv7-a -DCONFIG_GUEST_INIT -Wdate-time -D_FORTIFY_SOURCE=2 -DCONFIG_ARM -D_FILE_OFFSET_BITS=64 -D_GNU_SOURCE -DKVMTOOLS_VERSION='""' -DBUILD_ARCH='"arm"' -Iinclude -Iarm/include -Iarm/aarch32/include -O2 -fno-strict-aliasing -g -Wall -Wformat=2 -Winit-self -Wmissing-declarations -Wmissing-prototypes -Wnested-externs -Wno-system-headers -Wold-style-definition -Wredundant-decls -Wsign-compare -Wstrict-prototypes -Wundef -Wvolatile-register-var -Wwrite-strings -Wno-format-nonliteral -Werror -DCONFIG_HAS_ZLIB -DCONFIG_HAS_AIO -DCONFIG_HAS_LIBFDT kvm.c -o kvm.o
gcc -c -Wp,-MD,./.main.o.d  -march=armv7-a -DCONFIG_GUEST_INIT -Wdate-time -D_FORTIFY_SOURCE=2 -DCONFIG_ARM -D_FILE_OFFSET_BITS=64 -D_GNU_SOURCE -DKVMTOOLS_VERSION='""' -DBUILD_ARCH='"arm"' -Iinclude -Iarm/include -Iarm/aarch32/include -O2 -fno-strict-aliasing -g -Wall -Wformat=2 -Winit-self -Wmissing-declarations -Wmissing-prototypes -Wnested-externs -Wno-system-headers -Wold-style-definition -Wredundant-decls -Wsign-compare -Wstrict-prototypes -Wundef -Wvolatile-register-var -Wwrite-strings -Wno-format-nonliteral -Werror -DCONFIG_HAS_ZLIB -DCONFIG_HAS_AIO -DCONFIG_HAS_LIBFDT main.c -o main.o
gcc -c -Wp,-MD,./.mmio.o.d  -march=armv7-a -DCONFIG_GUEST_INIT -Wdate-time -D_FORTIFY_SOURCE=2 -DCONFIG_ARM -D_FILE_OFFSET_BITS=64 -D_GNU_SOURCE -DKVMTOOLS_VERSION='""' -DBUILD_ARCH='"arm"' -Iinclude -Iarm/include -Iarm/aarch32/include -O2 -fno-strict-aliasing -g -Wall -Wformat=2 -Winit-self -Wmissing-declarations -Wmissing-prototypes -Wnested-externs -Wno-system-headers -Wold-style-definition -Wredundant-decls -Wsign-compare -Wstrict-prototypes -Wundef -Wvolatile-register-var -Wwrite-strings -Wno-format-nonliteral -Werror -DCONFIG_HAS_ZLIB -DCONFIG_HAS_AIO -DCONFIG_HAS_LIBFDT mmio.c -o mmio.o
cc1: all warnings being treated as errors
make[1]: *** [Makefile:435: builtin-run.o] Error 1
make[1]: *** Waiting for unfinished jobs....
make[1]: Leaving directory '/<<PKGBUILDDIR>>'
dh_auto_build: make -j4 returned exit code 2
make: *** [debian/rules:3: build-arch] Error 2

Tail of log for ngs-sdk on armhf:

   debian/rules override_dh_auto_build
make[1]: Entering directory '/<<PKGBUILDDIR>>'
#dh_auto_build --sourcedirectory=ngs-sdk
echo "DEBPKGNAME: EBPKGNAME"
DEBPKGNAME: EBPKGNAME
dh_auto_build --sourcedirectory=ngs-sdk
	cd ngs-sdk && make -j4
make[2]: Entering directory '/<<PKGBUILDDIR>>/ngs-sdk'
*** File 'Makefile.config.linux.armv7l' is missing. Please run ./configure
make[2]: *** [/<<PKGBUILDDIR>>/ngs-sdk/Makefile.rules:72: Makefile.config.linux.armv7l] Error 1
make[2]: Leaving directory '/<<PKGBUILDDIR>>/ngs-sdk'
dh_auto_build: cd ngs-sdk && make -j4 returned exit code 2
make[1]: *** [debian/rules:43: override_dh_auto_build] Error 2
make[1]: Leaving directory '/<<PKGBUILDDIR>>'
make: *** [debian/rules:19: build-arch] Error 2

Tail of log for ocamlgsl on armhf:

lib/mlgsl_blas.h:29:28: warning: type of 'v' defaults to 'int' [-Wimplicit-int]
 static inline CBLAS_SIDE_t CBLAS_SIDE_val(v)
                            ^~~~~~~~~~~~~~
Command exited with code 2.
+ /usr/bin/ocamlopt.opt unix.cmxa -I /usr/lib/ocaml/ocamlbuild /usr/lib/ocaml/ocamlbuild/ocamlbuildlib.cmxa myocamlbuild.ml /usr/lib/ocaml/ocamlbuild/ocamlbuild.cmx -o myocamlbuild
File "myocamlbuild.ml", line 518, characters 43-62:
Warning 3: deprecated: Ocamlbuild_plugin.String.uncapitalize
Use String.uncapitalize_ascii instead.
File "myocamlbuild.ml", line 531, characters 51-70:
Warning 3: deprecated: Ocamlbuild_plugin.String.uncapitalize
Use String.uncapitalize_ascii instead.
E: Failure("Command ''/usr/bin/ocamlbuild' lib/libgsl_stubs.a lib/dllgsl_stubs.so lib/gsl.cma lib/gsl.cmxa lib/gsl.a lib/gsl.cmxs examples/blas_ex.native examples/blas_speed_test.native examples/bspline_ex.native examples/cheb_ex.native examples/combi_ex.native examples/const_ex.native examples/deriv_ex.native examples/eigen_ex.native examples/fft_c.native examples/fft_c2.native examples/fft_hc.native examples/fit_ex.native examples/histo_ex.native examples/integration_ex.native examples/interp_ex.native examples/linalg_ex.native examples/min_ex.native examples/monte_ex.native examples/multifit_data_ex.native examples/multifit_nlin_ex.native examples/multimin_ex.native examples/multiroot_ex.native examples/odeiv_ex.native examples/permut_ex.native examples/qrng_ex.native examples/rng_ex.native examples/root_ex.native examples/siman_ex.native examples/siman_tsp_ex.native examples/stats_ex.native examples/sum_ex.native examples/wavelet_ex.native -tag debug -tag tests' terminated with error code 10")
make[1]: *** [debian/rules:22: override_dh_auto_build] Error 1
make[1]: Leaving directory '/<<PKGBUILDDIR>>'
make: *** [debian/rules:9: build-arch] Error 2

Tail of log for blastem on armhf:

dpkg-buildpackage: info: source package blastem
dpkg-buildpackage: info: source version 0.6.2.1-1
dpkg-buildpackage: info: source distribution unstable
 dpkg-source --before-build .
dpkg-buildpackage: info: host architecture armhf
 fakeroot debian/rules clean
dh clean
   dh_auto_clean
	make -j4 distclean
make[1]: Entering directory '/<<PKGBUILDDIR>>'
Makefile:196: *** armv7l is not a supported architecture.  Stop.
make[1]: Leaving directory '/<<PKGBUILDDIR>>'
dh_auto_clean: make -j4 distclean returned exit code 2
make: *** [debian/rules:7: clean] Error 2

Tail of log for freefoam on armhf:

/usr/bin/cmake -E cmake_link_script CMakeFiles/cmTC_b1d57.dir/link.txt --verbose=1
/usr/bin/cc -g -O2 -fdebug-prefix-map=/<<BUILDDIR>>/freefoam-0.1.0+dfsg+1=. -fstack-protector-strong -Wformat -Werror=format-security -Wdate-time -D_FORTIFY_SOURCE=2 -DCHECK_FUNCTION_EXISTS=handle_sigfpes  -Wl,-z,relro  -rdynamic CMakeFiles/cmTC_b1d57.dir/CheckFunctionExists.c.o  -o cmTC_b1d57 
/usr/bin/ld: CMakeFiles/cmTC_b1d57.dir/CheckFunctionExists.c.o: in function `main':
/usr/share/cmake-3.13/Modules/CheckFunctionExists.c:17: undefined reference to `handle_sigfpes'
collect2: error: ld returned 1 exit status
make[3]: *** [CMakeFiles/cmTC_b1d57.dir/build.make:87: cmTC_b1d57] Error 1
make[3]: Leaving directory '/<<BUILDDIR>>/freefoam-0.1.0+dfsg+1/obj-arm-linux-gnueabihf/CMakeFiles/CMakeTmp'
make[2]: *** [Makefile:121: cmTC_b1d57/fast] Error 2
make[2]: Leaving directory '/<<BUILDDIR>>/freefoam-0.1.0+dfsg+1/obj-arm-linux-gnueabihf/CMakeFiles/CMakeTmp'


dh_auto_configure: cd obj-arm-linux-gnueabihf && cmake -DCMAKE_INSTALL_PREFIX=/usr -DCMAKE_BUILD_TYPE=None -DCMAKE_INSTALL_SYSCONFDIR=/etc -DCMAKE_INSTALL_LOCALSTATEDIR=/var -DCMAKE_EXPORT_NO_PACKAGE_REGISTRY=ON -DCMAKE_FIND_PACKAGE_NO_PACKAGE_REGISTRY=ON "-GUnix Makefiles" -DCMAKE_VERBOSE_MAKEFILE=ON -DCMAKE_INSTALL_LIBDIR=lib/arm-linux-gnueabihf -DFOAM_EXE_PREFIX=freefoam- -DFOAM_ENABLE_METIS=OFF -DFOAM_ENABLE_MGRIDGEN=OFF -DFOAM_USE_MPI=ON -DFOAM_DEFAULT_PSTREAM=mpi -DFOAM_DOUBLE_PRECISION=ON -DFOAM_ENABLE_PARMETIS=OFF -DCMAKE_SKIP_RPATH=OFF -DFOAM_ENABLE_CCMIO=OFF -DBUILD_TESTING=OFF -DFOAM_ENABLE_FULL_TUTORIAL_TEST=OFF -DFOAM_BUILD_PRIVATE_METIS=OFF -DFOAM_BUILD_PRIVATE_PARMETIS=OFF -DFOAM_BUILD_PRIVATE_SCOTCH=OFF -DFOAM_BUILD_PRIVATE_ZLIB=OFF -DFOAM_ENABLE_PDF_GUIDES=OFF -DFOAM_ENABLE_XHTML_GUIDES=OFF -DFOAM_ENABLE_XHTML_HELP=OFF -DFOAM_ENABLE_MATHJAX=OFF -DFOAM_ENABLE_MANPAGE_HELP=OFF -DFOAM_DOCS_FOR_SF=OFF -DFOAM_INSTALL_BIN_PATH=/usr/bin -DFOAM_INSTALL_CMAKE_PATH=/usr/share/freefoam/CMake -DFOAM_INSTALL_CONFIG_PATH=/etc/freefoam -DFOAM_INSTALL_DATA_PATH=/usr/share/freefoam -DFOAM_INSTALL_DOC_PATH=/usr/share/doc/freefoam -DFOAM_INSTALL_HEADER_PATH=/usr/include/freefoam -DFOAM_INSTALL_LIBEXEC_PATH=/usr/bin -DFOAM_INSTALL_LIBRARY_PATH=/usr/lib/freefoam -DFOAM_INSTALL_MAN_PATH=/usr/share/man -DFOAM_INSTALL_PLUGIN_PATH=/usr/lib/freefoam/plugins1 -DFOAM_INSTALL_TUTORIALS_PATH=/usr/share/doc/freefoam -DFOAM_INSTALL_USERDFOAM_PATH=/usr/lib/freefoam/plugins1/ensightReader -DFOAM_ENABLE_DOXYGEN_DOCS=OFF .. returned exit code 1
make[1]: *** [debian/rules:68: override_dh_auto_configure] Error 2
make[1]: Leaving directory '/<<BUILDDIR>>/freefoam-0.1.0+dfsg+1'
make: *** [debian/rules:3: build-arch] Error 2

Tail of log for lib3mf on armhf:

+ _ZTVSt23_Sp_counted_ptr_inplaceIN3NMR5CUUIDESaIS1_ELN9__gnu_cxx12_Lock_policyE1EE@Base 1.8.0
+#MISSING: 1.8.1+ds-3# (arch=!armel !riscv64)_ZTVSt23_Sp_counted_ptr_inplaceIN3NMR5CUUIDESaIS1_ELN9__gnu_cxx12_Lock_policyE2EE@Base 1.8.0
+ _ZTVSt23_Sp_counted_ptr_inplaceIN3NMR6CModelESaIS1_ELN9__gnu_cxx12_Lock_policyE1EE@Base 1.8.0
+#MISSING: 1.8.1+ds-3# (arch=!armel !riscv64)_ZTVSt23_Sp_counted_ptr_inplaceIN3NMR6CModelESaIS1_ELN9__gnu_cxx12_Lock_policyE2EE@Base 1.8.0
+ _ZTVSt23_Sp_counted_ptr_inplaceIN3NMR6CSliceESaIS1_ELN9__gnu_cxx12_Lock_policyE1EE@Base 1.8.0
+#MISSING: 1.8.1+ds-3# (arch=!armel !riscv64)_ZTVSt23_Sp_counted_ptr_inplaceIN3NMR6CSliceESaIS1_ELN9__gnu_cxx12_Lock_policyE2EE@Base 1.8.0
+ _ZTVSt23_Sp_counted_ptr_inplaceIN3NMR7BEAMSETESaIS1_ELN9__gnu_cxx12_Lock_policyE1EE@Base 1.8.0
+#MISSING: 1.8.1+ds-3# (arch=!armel !riscv64)_ZTVSt23_Sp_counted_ptr_inplaceIN3NMR7BEAMSETESaIS1_ELN9__gnu_cxx12_Lock_policyE2EE@Base 1.8.0
  (arch=!ia64 !powerpcspe)_ZZNSt19_Sp_make_shared_tag5_S_tiEvE5__tag@Base 1.8.0
  lib3mf_attachment_getpath@Base 1.8.0+ds
  lib3mf_attachment_getpathutf8@Base 1.8.0+ds
	mv debian/.debhelper/generated/lib3mf1/triggers.new debian/.debhelper/generated/lib3mf1/triggers
	rm -f debian/lib3mf-dev/DEBIAN/shlibs
dh_makeshlibs: failing due to earlier errors
make: *** [debian/rules:9: binary-arch] Error 2

Tail of log for libxsmm on armhf:

   ^~~~~
In file included from include/libxsmm.h:65,
                 from ./src/libxsmm_gemm_diff.h:34,
                 from ./src/libxsmm_main.c:31:
./src/libxsmm_main.c: In function 'libxsmm_init':
include/libxsmm_sync.h:70:29: warning: implicit declaration of function '__builtin_ia32_pause'; did you mean '__builtin_isspace'? [-Wimplicit-function-declaration]
 # define LIBXSMM_SYNC_PAUSE __builtin_ia32_pause()
                             ^~~~~~~~~~~~~~~~~~~~
./src/libxsmm_main.c:719:36: note: in expansion of macro 'LIBXSMM_SYNC_PAUSE'
       if (0 != once) break; else { LIBXSMM_SYNC_PAUSE; }
                                    ^~~~~~~~~~~~~~~~~~
make[1]: *** [Makefile:721: build/intel64/libxsmm_main.o] Error 1
make[1]: Leaving directory '/<<PKGBUILDDIR>>'
dh_auto_build: make -j1 returned exit code 2
make: *** [debian/rules:7: build-arch] Error 2

Tail of log for minimap2 on armhf:

                                                           ~~^                                                   ~~~~~~~~~~~~
                                                           %d
cc -c -g -O2 -fdebug-prefix-map=/<<BUILDDIR>>/minimap2-2.15+dfsg=. -fstack-protector-strong -Wformat -Werror=format-security -g -Wall -O2 -Wc++-compat  -Wdate-time -D_FORTIFY_SOURCE=2 -DHAVE_KALLOC  format.c -o format.o
cc -c -g -O2 -fdebug-prefix-map=/<<BUILDDIR>>/minimap2-2.15+dfsg=. -fstack-protector-strong -Wformat -Werror=format-security -g -Wall -O2 -Wc++-compat  -Wdate-time -D_FORTIFY_SOURCE=2 -DHAVE_KALLOC  pe.c -o pe.o
cc -c -g -O2 -fdebug-prefix-map=/<<BUILDDIR>>/minimap2-2.15+dfsg=. -fstack-protector-strong -Wformat -Werror=format-security -g -Wall -O2 -Wc++-compat  -Wdate-time -D_FORTIFY_SOURCE=2 -DHAVE_KALLOC  esterr.c -o esterr.o
cc -c -g -O2 -fdebug-prefix-map=/<<BUILDDIR>>/minimap2-2.15+dfsg=. -fstack-protector-strong -Wformat -Werror=format-security -g -Wall -O2 -Wc++-compat  -Wdate-time -D_FORTIFY_SOURCE=2 -DHAVE_KALLOC  splitidx.c -o splitidx.o
cc -c -g -O2 -fdebug-prefix-map=/<<BUILDDIR>>/minimap2-2.15+dfsg=. -fstack-protector-strong -Wformat -Werror=format-security -g -Wall -O2 -Wc++-compat  -msse2 -Wdate-time -D_FORTIFY_SOURCE=2 -DHAVE_KALLOC  ksw2_ll_sse.c -o ksw2_ll_sse.o
cc: error: unrecognized command line option '-msse2'
make[2]: *** [Makefile:51: ksw2_ll_sse.o] Error 1
make[2]: *** Waiting for unfinished jobs....
make[2]: Leaving directory '/<<BUILDDIR>>/minimap2-2.15+dfsg'
dh_auto_build: make -j4 "INSTALL=install --strip-program=true" returned exit code 2
make[1]: *** [debian/rules:13: override_dh_auto_build] Error 2
make[1]: Leaving directory '/<<BUILDDIR>>/minimap2-2.15+dfsg'
make: *** [debian/rules:6: build-arch] Error 2

Tail of log for orpie on armhf:

mlgsl_blas.h: In function 'CBLAS_UPLO_val':
mlgsl_blas.h:17:28: warning: type of 'v' defaults to 'int' [-Wimplicit-int]
 static inline CBLAS_UPLO_t CBLAS_UPLO_val(v)
                            ^~~~~~~~~~~~~~
mlgsl_blas.h: In function 'CBLAS_DIAG_val':
mlgsl_blas.h:23:28: warning: type of 'v' defaults to 'int' [-Wimplicit-int]
 static inline CBLAS_DIAG_t CBLAS_DIAG_val(v)
                            ^~~~~~~~~~~~~~
mlgsl_blas.h: In function 'CBLAS_SIDE_val':
mlgsl_blas.h:29:28: warning: type of 'v' defaults to 'int' [-Wimplicit-int]
 static inline CBLAS_SIDE_t CBLAS_SIDE_val(v)
                            ^~~~~~~~~~~~~~
make[1]: *** [Makefile:219: gsl/mlgsl_blas.o] Error 2
make[1]: Leaving directory '/<<PKGBUILDDIR>>'
make: *** [debian/rules:23: build-stamp] Error 2

Tail of log for prboom on armhf:

                                png_error_ptr
i_sshot.c:234:32: note: each undeclared identifier is reported only once for each function it appears in
i_sshot.c:282:43: error: 'png_infopp_NULL' undeclared (first use in this function); did you mean 'png_infopp'?
       png_destroy_write_struct(&png_ptr,  png_infopp_NULL);
                                           ^~~~~~~~~~~~~~~
                                           png_infopp
make[4]: *** [Makefile:242: i_sshot.o] Error 1
make[4]: Leaving directory '/<<BUILDDIR>>/prboom-2.5.0+dfsg1/src/SDL'
make[3]: *** [Makefile:460: all-recursive] Error 1
make[3]: Leaving directory '/<<BUILDDIR>>/prboom-2.5.0+dfsg1/src'
make[2]: *** [Makefile:285: all-recursive] Error 1
make[2]: Leaving directory '/<<BUILDDIR>>/prboom-2.5.0+dfsg1'
make[1]: *** [Makefile:205: all] Error 2
make[1]: Leaving directory '/<<BUILDDIR>>/prboom-2.5.0+dfsg1'
make: *** [debian/rules:28: build-stamp] Error 2

Tail of log for tarantool on armhf:

    ^~~~~
/<<PKGBUILDDIR>>/third_party/coro/coro.c:480:14: error: 'NUM_SAVED' undeclared (first use in this function)
   ctx->sp -= NUM_SAVED;
              ^~~~~~~~~
/<<PKGBUILDDIR>>/third_party/coro/coro.c:480:14: note: each undeclared identifier is reported only once for each function it appears in
/<<PKGBUILDDIR>>/third_party/coro/coro.c:494:4: error: #error unsupported architecture
   #error unsupported architecture
    ^~~~~
make[3]: *** [CMakeFiles/coro.dir/build.make:66: CMakeFiles/coro.dir/third_party/coro/coro.c.o] Error 1
make[3]: Leaving directory '/<<PKGBUILDDIR>>/obj-arm-linux-gnueabihf'
make[2]: *** [CMakeFiles/Makefile2:283: CMakeFiles/coro.dir/all] Error 2
make[2]: Leaving directory '/<<PKGBUILDDIR>>/obj-arm-linux-gnueabihf'
make[1]: *** [Makefile:155: all] Error 2
make[1]: Leaving directory '/<<PKGBUILDDIR>>/obj-arm-linux-gnueabihf'
make: *** [/usr/share/cdbs/1/class/makefile.mk:77: debian/stamp-makefile-build] Error 2

Tail of log for trilinos on armhf:

[  0%] Built target TeuchosParameterList_BadXmlTestFiles
[  0%] Built target TeuchosParameterList_CopyExampleXmlFiles
[  0%] Linking CXX shared library libtrilinos_kokkos_gtest.so
cd /<<PKGBUILDDIR>>/obj-arm-linux-gnueabihf/packages/kokkos/core/unit_test && /usr/bin/cmake -E cmake_link_script CMakeFiles/trilinos_kokkos_gtest.dir/link.txt --verbose=1
/usr/bin/mpicxx -fPIC   -g -O2 -fdebug-prefix-map=/<<PKGBUILDDIR>>=. -fstack-protector-strong -Wformat -Werror=format-security -Wdate-time -D_FORTIFY_SOURCE=2 -std=c++11 -Wl,-z,relro -Wl,-z,now -Wl,--as-needed -shared -Wl,-soname,libtrilinos_kokkos_gtest.so.12 -o libtrilinos_kokkos_gtest.so.12.12.1 CMakeFiles/trilinos_kokkos_gtest.dir/__/__/tpls/gtest/gtest/gtest-all.cc.o /usr/lib/arm-linux-gnueabihf/libdl.so 
cd /<<PKGBUILDDIR>>/obj-arm-linux-gnueabihf/packages/kokkos/core/unit_test && /usr/bin/cmake -E cmake_symlink_library libtrilinos_kokkos_gtest.so.12.12.1 libtrilinos_kokkos_gtest.so.12 libtrilinos_kokkos_gtest.so
make[4]: Leaving directory '/<<PKGBUILDDIR>>/obj-arm-linux-gnueabihf'
[  0%] Built target trilinos_kokkos_gtest
make[3]: Leaving directory '/<<PKGBUILDDIR>>/obj-arm-linux-gnueabihf'
make[2]: *** [Makefile:166: all] Error 2
make[2]: Leaving directory '/<<PKGBUILDDIR>>/obj-arm-linux-gnueabihf'
dh_auto_build: cd obj-arm-linux-gnueabihf && make -j4 "INSTALL=install --strip-program=true" returned exit code 2
make[1]: *** [debian/rules:81: override_dh_auto_build-arch] Error 2
make[1]: Leaving directory '/<<PKGBUILDDIR>>'
make: *** [debian/rules:70: build-arch] Error 2

Tail of log for qtox on armhf:

[ 84%] Built target test_textformatter
[ 84%] Linking CXX executable qtox
/usr/bin/cmake -E cmake_link_script CMakeFiles/qtox.dir/link.txt --verbose=1
/usr/bin/c++  -g -O2 -fdebug-prefix-map=/<<PKGBUILDDIR>>=. -fstack-protector-strong -Wformat -Werror=format-security -Wall -pedantic -Wdate-time -D_FORTIFY_SOURCE=2 -std=c++11 -fno-exceptions -fno-rtti -Wstrict-overflow -Wstrict-aliasing -fstack-protector-all -Wstack-protector -pthread -pthread  -Wl,-z,relro -Wl,-z,now -Wl,--as-needed -Wl,-z,now -Wl,-z,relro -rdynamic CMakeFiles/qtox.dir/qrc_res.cpp.o CMakeFiles/qtox.dir/qrc_translations.cpp.o CMakeFiles/qtox.dir/qrc_emojione.cpp.o CMakeFiles/qtox.dir/qrc_smileys.cpp.o CMakeFiles/qtox.dir/src/main.cpp.o CMakeFiles/qtox.dir/qtox_autogen/mocs_compilation.cpp.o  -o qtox libqtox_static.a /usr/lib/arm-linux-gnueabihf/libQt5Network.so.5.11.3 /usr/lib/arm-linux-gnueabihf/libQt5OpenGL.so.5.11.3 /usr/lib/arm-linux-gnueabihf/libQt5Svg.so.5.11.3 /usr/lib/arm-linux-gnueabihf/libQt5Widgets.so.5.11.3 /usr/lib/arm-linux-gnueabihf/libQt5Xml.so.5.11.3 -lavcodec -lavdevice -lavformat -lavutil -lexif -lqrencode -lsodium -lswscale -lsqlcipher -lvpx -lm -ltoxcore -lopenal -lX11 -lXss -lgdk_pixbuf-2.0 -lgobject-2.0 -lglib-2.0 -lglib-2.0 -lgtk-x11-2.0 -lgdk-x11-2.0 -lpangocairo-1.0 -latk-1.0 -lcairo -lgdk_pixbuf-2.0 -lgio-2.0 -lpangoft2-1.0 -lpango-1.0 -lgobject-2.0 -lglib-2.0 -lfontconfig -lfreetype /usr/lib/arm-linux-gnueabihf/libQt5Gui.so.5.11.3 /usr/lib/arm-linux-gnueabihf/libQt5Core.so.5.11.3 -lgdk_pixbuf-2.0 -lgtk-x11-2.0 -lgdk-x11-2.0 -lpangocairo-1.0 -latk-1.0 -lcairo -lgio-2.0 -lpangoft2-1.0 -lpango-1.0 -lfontconfig -lfreetype 
/usr/bin/ld: libqtox_static.a(camerasource.cpp.o): undefined reference to symbol '__atomic_fetch_add_8@@LIBATOMIC_1.0'
/usr/bin/ld: //usr/lib/arm-linux-gnueabihf/libatomic.so.1: error adding symbols: DSO missing from command line
collect2: error: ld returned 1 exit status
make[3]: *** [CMakeFiles/qtox.dir/build.make:3267: qtox] Error 1
make[3]: Leaving directory '/<<PKGBUILDDIR>>/obj-arm-linux-gnueabihf'
make[2]: *** [CMakeFiles/Makefile2:190: CMakeFiles/qtox.dir/all] Error 2
make[2]: Leaving directory '/<<PKGBUILDDIR>>/obj-arm-linux-gnueabihf'
make[1]: *** [Makefile:144: all] Error 2
make[1]: Leaving directory '/<<PKGBUILDDIR>>/obj-arm-linux-gnueabihf'
dh_auto_build: cd obj-arm-linux-gnueabihf && make -j4 "INSTALL=install --strip-program=true" returned exit code 2
make: *** [debian/rules:17: build-arch] Error 2

Tail of log for agda on armhf:

[156 of 338] Compiling Agda.Compiler.Treeless.Uncase ( src/full/Agda/Compiler/Treeless/Uncase.hs, dist-ghc/build/Agda/Compiler/Treeless/Uncase.o )
[157 of 338] Compiling Agda.Compiler.Treeless.AsPatterns ( src/full/Agda/Compiler/Treeless/AsPatterns.hs, dist-ghc/build/Agda/Compiler/Treeless/AsPatterns.o )
[158 of 338] Compiling Agda.TypeChecking.Serialise.Base ( src/full/Agda/TypeChecking/Serialise/Base.hs, dist-ghc/build/Agda/TypeChecking/Serialise/Base.o )
ghc: panic! (the 'impossible' happened)
  (GHC version 8.4.4 for arm-unknown-linux):
	tyThingCoAxiom
  Identifier ‘fromDescListWithKey’
  Call stack:
      CallStack (from HasCallStack):
        callStackDoc, called at compiler/utils/Outputable.hs:1150:37 in ghc:Outputable
        pprPanic, called at compiler/main/HscTypes.hs:2153:32 in ghc:HscTypes

Please report this as a GHC bug:  http://www.haskell.org/ghc/reportabug

make: *** [/usr/share/cdbs/1/class/hlibrary.mk:147: build-ghc-stamp] Error 1

BinNMU changelog for nbibtex on armhf:

rebuild due to debcheck failure

Tail of log for nbibtex on armhf:

executing: latex \nonstopmode \input{nbib.tex}
compiling nbib.tex...
executing: latex \nonstopmode \input{nbib.tex}
compiling nbib.tex...
executing: latex \nonstopmode \input{nbib.tex}
compiling nbib.tex...
executing: latex \nonstopmode \input{nbib.tex}
compiling nbib.tex...
executing: latex \nonstopmode \input{nbib.tex}
[depend] while making nbib.dvi: file contents does not seem to settle
There were errors compiling nbib.aux.
make[1]: *** [Makefile:56: nbib.ps] Error 2
make[1]: Leaving directory '/<<PKGBUILDDIR>>'
dh_auto_build: make -j4 returned exit code 2
make: *** [debian/rules:4: build-arch] Error 2