Raspbian Package Auto-Building

Buildd status for r-bioc-dada2 (bullseye-staging)

Debian PTSTrackerChangelogBugspackages.d.obuildd.d.o

Package(s): Suite:
Compact mode Co-maintainers

ArchitectureVersionStatusForBuilddStateMiscLogs
Buildd exposure stats armhf  1.14.0+dfsg-1Build-Attempted10d 8h 41mmb-lxc-01uncompiledmisc:sourceold | all (2)

Tail of log for r-bioc-dada2 on armhf:

make[1]: Entering directory '/<<BUILDDIR>>/r-bioc-dada2-1.14.0+dfsg/src'
g++ -std=gnu++11 -I"/usr/share/R/include" -DNDEBUG  -I"/usr/lib/R/site-library/Rcpp/include" -I"/usr/lib/R/site-library/RcppParallel/include"   -fpic  -g -O2 -fdebug-prefix-map=/build/r-base-jEdEmw/r-base-3.6.1=. -fstack-protector-strong -Wformat -Werror=format-security -Wdate-time -D_FORTIFY_SOURCE=2 -g  -c RcppExports.cpp -o RcppExports.o
g++ -std=gnu++11 -I"/usr/share/R/include" -DNDEBUG  -I"/usr/lib/R/site-library/Rcpp/include" -I"/usr/lib/R/site-library/RcppParallel/include"   -fpic  -g -O2 -fdebug-prefix-map=/build/r-base-jEdEmw/r-base-3.6.1=. -fstack-protector-strong -Wformat -Werror=format-security -Wdate-time -D_FORTIFY_SOURCE=2 -g  -c Rmain.cpp -o Rmain.o
Rmain.cpp:7:10: fatal error: cpuid.h: No such file or directory
    7 | #include <cpuid.h>
      |          ^~~~~~~~~
compilation terminated.
make[1]: *** [/usr/lib/R/etc/Makeconf:176: Rmain.o] Error 1
make[1]: Leaving directory '/<<BUILDDIR>>/r-bioc-dada2-1.14.0+dfsg/src'
make[1]: Entering directory '/<<BUILDDIR>>/r-bioc-dada2-1.14.0+dfsg/src'
make[1]: Leaving directory '/<<BUILDDIR>>/r-bioc-dada2-1.14.0+dfsg/src'
ERROR: compilation failed for package 'dada2'
* removing '/<<BUILDDIR>>/r-bioc-dada2-1.14.0+dfsg/debian/r-bioc-dada2/usr/lib/R/site-library/dada2'
dh_auto_install: R CMD INSTALL -l /<<BUILDDIR>>/r-bioc-dada2-1.14.0\+dfsg/debian/r-bioc-dada2/usr/lib/R/site-library --clean . "--built-timestamp='Tue, 12 Nov 2019 00:07:38 +0100'" returned exit code 1
make: *** [debian/rules:4: binary-arch] Error 255