Raspbian Package Auto-Building

Buildd status for qwinff (bullseye-staging)

Debian PTSTrackerChangelogBugspackages.d.obuildd.d.o

Package(s): Suite:
Compact mode Co-maintainers

ArchitectureVersionStatusForBuilddStateMiscLogs
Buildd exposure stats armhf  0.2.1+git20191128-1Build-Attempted5d 7h 37mmb-lxc-01uncompiledmisc:extraold | all (1)

Tail of log for qwinff on armhf:

      |     ^~~~~~~
src/qmpwidget/qmpwidget.cpp:166:5: error: 'glTexCoord2f' was not declared in this scope
  166 |     glTexCoord2f(0, 0); glVertex2f(-1, -1);
      |     ^~~~~~~~~~~~
src/qmpwidget/qmpwidget.cpp:166:25: error: 'glVertex2f' was not declared in this scope; did you mean 'glVertexAttrib2f'?
  166 |     glTexCoord2f(0, 0); glVertex2f(-1, -1);
      |                         ^~~~~~~~~~
      |                         glVertexAttrib2f
src/qmpwidget/qmpwidget.cpp:170:5: error: 'glEnd' was not declared in this scope
  170 |     glEnd();
      |     ^~~~~
make[1]: *** [Makefile:1145: qmpwidget.o] Error 1
make[1]: Leaving directory '/<<BUILDDIR>>/qwinff-0.2.1+git20191128'
dh_auto_build: make -j4 "INSTALL=install --strip-program=true" returned exit code 2
make: *** [debian/rules:18: build-arch] Error 255